program: Orca
programVersion: 5.0.2
elementType: Cl Cl S S P O O C C C C C C C C C C C H H H H H H H H H H H H H H H
charge: 0
multiplicity: 1
keywords: wb97x-d3
keywords: def2-TZVPP
keywords: def2/J RIJCOSX
keywords: DEFGRID2
keywords: scfconv7
keywords: smallprint printgap noloewdin
keywords: NOSOSCF
formula: C11H15Cl2O2PS2
InChI: InChI=1/C11H15Cl2O2PS2/c1-3-7-18-16(17,14-4-2)15-11-6-5-9(12)8-10(11)13/h5-6,8H,3-4,7H2,1-2H3
33 atoms
Cl -0.752033 1.055876 -2.592762
Cl -4.774051 -1.138342 0.199708
S  1.99165 -0.792329 -1.168344
S  1.971255 -0.023331 2.142906
P  1.840283 0.620751 0.339068
O  0.462915 1.471037 0.033601
O  2.89847 1.682072 -0.195316
C  1.711227 -2.358274 -0.27578
C  0.246681 -2.678834 -0.041981
C  0.070474 -4.057653 0.578196
C  -0.759319 0.87307 0.09576
C  2.87281 3.086474 0.105269
C  -1.440326 0.602221 -1.087226
C  -1.343529 0.545855 1.310555
C  2.897085 3.406026 1.584111
C  -2.682589 -0.010836 -1.058023
C  -2.582269 -0.070386 1.349935
C  -3.237556 -0.354714 0.163082
H  2.273729 -2.328974 0.658076
H  2.179256 -3.106571 -0.919098
H  -0.186219 -1.925117 0.61778
H  -0.297012 -2.616565 -0.986722
H  0.581134 -4.128789 1.539322
H  -0.983676 -4.273305 0.748759
H  0.466596 -4.843097 -0.067633
H  3.765094 3.477669 -0.38121
H  2.005611 3.540197 -0.378019
H  -0.816581 0.768482 2.22751
H  1.977186 3.113775 2.0877
H  3.728341 2.914843 2.0874
H  3.014187 4.483245 1.706535
H  -3.204063 -0.220526 -1.980934
H  -3.029481 -0.331046 2.298517
totalener: -2636.98934463 hartree
nucrepener: 2184.17079106 hartree
electener: -4821.16013570 hartree
oneelecener: -7979.96926535 hartree
twoeener: 3158.80912965 hartree
kineticenergy: 2631.05855402 hartree
xcener: -154.164259830236 hartree
chargesum: 0.0000000
charge: -0.043629 -0.066964 -0.118657 -0.376682 0.599673 -0.334553 -0.318544 -0.108286 -0.084648 -0.247222 0.203916 0.028168 0.005292 -0.141149 -0.249203 -0.118620 -0.123565 0.065853 0.115738 0.113637 0.044966 0.071161 0.083416 0.089153 0.077918 0.098329 0.090715 0.133667 0.082365 0.098557 0.086772 0.116358 0.126068
qa: -0.0436 -0.0670 -0.1187 -0.3767 0.5997 -0.3346 -0.3185 -0.1083 -0.0846 -0.2472 0.2039 0.0282 0.0053 -0.1411 -0.2492 -0.1186 -0.1236 0.0659 0.1157 0.1136 0.0450 0.0712 0.0834 0.0892 0.0779 0.0983 0.0907 0.1337 0.0824 0.0986 0.0868 0.1164 0.1261
va: 1.2661 1.2346 2.3526 2.0604 5.3914 2.0748 2.1738 3.8701 3.8851 3.9540 3.8395 3.8907 4.0023 3.9717 3.9281 4.0110 4.0051 3.9265 1.0342 1.0092 1.0222 1.0134 1.0035 1.0061 1.0044 0.9851 0.9999 1.0224 1.0135 1.0060 1.0125 1.0220 1.0107
dispcorr: -0.019821400 hartree
energy: -2637.009166034265
dipole: 16.39784 -16.39845 -0.00061 -6.20412 6.42986 0.22574 11.67417 -11.68058 -0.00641
magnitude: 0.22583 au
magnitude: 0.57402 debye
