program: Orca
programVersion: 5.0.2
elementType: Cl Cl S S P O O C C C C C C C C C C C H H H H H H H H H H H H H H H
charge: 0
multiplicity: 1
keywords: wb97x-d3
keywords: def2-TZVPP
keywords: def2/J RIJCOSX
keywords: DEFGRID2
keywords: scfconv7
keywords: smallprint printgap noloewdin
keywords: NOSOSCF
formula: C11H15Cl2O2PS2
InChI: InChI=1/C11H15Cl2O2PS2/c1-3-7-18-16(17,14-4-2)15-11-6-5-9(12)8-10(11)13/h5-6,8H,3-4,7H2,1-2H3
33 atoms
Cl -0.576548 1.659873 -2.130678
Cl -5.407901 0.01021 -0.460562
S  1.209911 -1.097166 -0.904795
S  1.229286 -1.019181 2.502779
P  1.369821 -0.021298 0.879902
O  0.234075 1.129293 0.612101
O  2.678691 0.880172 0.820125
C  1.972082 -2.677162 -0.40152
C  3.479811 -2.608929 -0.234906
C  4.064953 -3.974013 0.098832
C  -1.075663 0.833093 0.382259
C  3.041009 1.697229 -0.305703
C  -1.600574 1.060713 -0.884877
C  -1.898641 0.353291 1.38816
C  2.722429 3.15246 -0.054663
C  -2.936778 0.814465 -1.14987
C  -3.234771 0.097348 1.132887
C  -3.74385 0.327091 -0.13501
H  1.696152 -3.368351 -1.200483
H  1.480218 -3.012715 0.512362
H  3.929358 -2.217906 -1.150111
H  3.725382 -1.904007 0.562064
H  5.146496 -3.915486 0.217527
H  3.653292 -4.364055 1.030268
H  3.859291 -4.702227 -0.687134
H  4.113507 1.551203 -0.43552
H  2.552806 1.339901 -1.215847
H  -1.487459 0.182461 2.373338
H  1.650261 3.324704 0.011789
H  3.191184 3.508567 0.861757
H  3.106755 3.750867 -0.881442
H  -3.336687 0.995159 -2.137167
H  -3.874235 -0.278737 1.918433
totalener: -2636.99287991 hartree
nucrepener: 2143.80847417 hartree
electener: -4780.80135408 hartree
oneelecener: -7899.09210432 hartree
twoeener: 3118.29075025 hartree
kineticenergy: 2631.05183206 hartree
xcener: -154.160240658523 hartree
chargesum: -0.0000000
charge: -0.060472 -0.067056 -0.171624 -0.356749 0.601458 -0.343895 -0.302802 -0.093900 -0.098003 -0.249595 0.210934 0.013966 0.015626 -0.152947 -0.221647 -0.094774 -0.112536 0.047900 0.112494 0.117459 0.063995 0.070751 0.087993 0.084711 0.073945 0.100016 0.083481 0.142866 0.082793 0.090228 0.081515 0.118654 0.125215
qa: -0.0605 -0.0671 -0.1716 -0.3567 0.6015 -0.3439 -0.3028 -0.0939 -0.0980 -0.2496 0.2109 0.0140 0.0156 -0.1529 -0.2216 -0.0948 -0.1125 0.0479 0.1125 0.1175 0.0640 0.0708 0.0880 0.0847 0.0739 0.1000 0.0835 0.1429 0.0828 0.0902 0.0815 0.1187 0.1252
va: 1.2519 1.2349 2.3175 2.1072 5.4086 2.1123 2.1299 3.8937 3.8728 3.9623 3.8510 3.8780 3.9827 4.0733 3.9308 4.0004 4.0307 3.9507 1.0064 1.0341 1.0156 1.0269 1.0061 1.0037 1.0027 0.9937 1.0131 1.0137 1.0205 1.0068 1.0090 1.0175 1.0098
dispcorr: -0.018098173 hartree
energy: -2637.010978078404
dipole: 34.54523 -33.92107 0.62416 -10.75664 10.73968 -0.01696 2.23777 -3.02949 -0.79171
magnitude: 1.00830 au
magnitude: 2.56290 debye
