program: Orca
programVersion: 5.0.2
elementType: Cl Cl S S P O O C C C C C C C C C C C H H H H H H H H H H H H H H H
charge: 0
multiplicity: 1
keywords: wb97x-d3
keywords: def2-TZVPP
keywords: def2/J RIJCOSX
keywords: DEFGRID2
keywords: scfconv7
keywords: smallprint printgap noloewdin
keywords: NOSOSCF
formula: C11H15Cl2O2PS2
InChI: InChI=1/C11H15Cl2O2PS2/c1-3-7-18-16(17,14-4-2)15-11-6-5-9(12)8-10(11)13/h5-6,8H,3-4,7H2,1-2H3
33 atoms
Cl -0.873612 0.97492 -2.581989
Cl -4.880955 -1.374476 0.107897
S  1.892079 -0.663223 -1.05367
S  1.842544 0.154243 2.251971
P  1.631098 0.766043 0.443292
O  0.221299 1.489223 0.074123
O  2.520497 2.001346 -0.028127
C  2.276505 -2.213362 -0.16369
C  1.170906 -3.251043 -0.270909
C  -0.13474 -2.841872 0.389798
C  -0.959907 0.810635 0.104617
C  3.938828 1.985123 0.179414
C  -1.592465 0.505515 -1.096086
C  -1.55778 0.459717 1.304607
C  4.315941 2.859723 1.35175
C  -2.806656 -0.162132 -1.097881
C  -2.768175 -0.211461 1.312868
C  -3.378987 -0.525566 0.109835
H  2.486633 -1.963369 0.877298
H  3.200021 -2.579747 -0.612349
H  0.997989 -3.501557 -1.320187
H  1.553322 -4.162637 0.198154
H  -0.844495 -3.668564 0.388137
H  0.020599 -2.533029 1.423988
H  -0.603332 -2.011499 -0.13635
H  4.298617 0.962667 0.327992
H  4.37891 2.352009 -0.74765
H  -1.068218 0.713682 2.234285
H  3.902092 2.470918 2.280797
H  5.401328 2.892649 1.449823
H  3.959428 3.879633 1.211873
H  -3.292713 -0.398718 -2.033481
H  -3.229387 -0.489638 2.249607
totalener: -2636.99090794 hartree
nucrepener: 2177.53957724 hartree
electener: -4814.53048518 hartree
oneelecener: -7966.71844572 hartree
twoeener: 3152.18796054 hartree
kineticenergy: 2631.06828343 hartree
xcener: -154.166466450247 hartree
chargesum: -0.0000000
charge: -0.042538 -0.067410 -0.153335 -0.380940 0.598903 -0.309896 -0.305372 -0.117891 -0.081867 -0.232521 0.184613 0.026181 0.016761 -0.139068 -0.222580 -0.100792 -0.121661 0.061167 0.113464 0.117611 0.066696 0.067683 0.096243 0.082364 0.042578 0.071998 0.099683 0.138504 0.084696 0.079417 0.088118 0.114979 0.124211
qa: -0.0425 -0.0674 -0.1533 -0.3809 0.5989 -0.3099 -0.3054 -0.1179 -0.0819 -0.2325 0.1846 0.0262 0.0168 -0.1391 -0.2226 -0.1008 -0.1217 0.0612 0.1135 0.1176 0.0667 0.0677 0.0962 0.0824 0.0426 0.0720 0.0997 0.1385 0.0847 0.0794 0.0881 0.1150 0.1242
va: 1.2686 1.2335 2.3244 2.0651 5.4437 2.1610 2.1474 3.8643 3.8856 3.9384 3.8709 3.9046 3.9775 3.9711 3.9368 3.9965 4.0062 3.9275 1.0511 1.0096 1.0108 1.0105 1.0113 1.0085 1.0206 1.0082 0.9928 1.0119 1.0195 1.0100 1.0055 1.0236 1.0108
dispcorr: -0.019819790 hartree
energy: -2637.010727735396
dipole: 25.64343 -24.84410 0.79933 -7.92356 7.46805 -0.45551 10.24514 -10.28557 -0.04042
magnitude: 0.92090 au
magnitude: 2.34074 debye
