program: Orca
programVersion: 5.0.2
elementType: Cl Cl S S P O O C C C C C C C C C C C H H H H H H H H H H H H H H H
charge: 0
multiplicity: 1
keywords: wb97x-d3
keywords: def2-TZVPP
keywords: def2/J RIJCOSX
keywords: DEFGRID2
keywords: scfconv7
keywords: smallprint printgap noloewdin
keywords: NOSOSCF
formula: C11H15Cl2O2PS2
InChI: InChI=1/C11H15Cl2O2PS2/c1-3-7-18-16(17,14-4-2)15-11-6-5-9(12)8-10(11)13/h5-6,8H,3-4,7H2,1-2H3
33 atoms
Cl -0.728809 2.657028 0.811366
Cl -4.685104 -0.957103 0.57068
S  2.679803 -1.414623 -1.202717
S  1.846568 0.003457 1.805242
P  2.072452 0.232441 -0.082888
O  0.725519 0.743899 -0.87384
O  3.105526 1.327823 -0.600022
C  2.924544 -2.677144 0.095797
C  1.655211 -3.423411 0.462281
C  1.923198 -4.476582 1.528375
C  -0.516622 0.319504 -0.513973
C  3.109435 2.665512 -0.065764
C  -1.321085 1.136868 0.27229
C  -1.009537 -0.897061 -0.958075
C  2.515415 3.644777 -1.050024
C  -2.607563 0.7481 0.6056
C  -2.291723 -1.299568 -0.625869
C  -3.082108 -0.472715 0.155801
H  3.371777 -2.197318 0.966445
H  3.671535 -3.351045 -0.328536
H  0.913758 -2.710317 0.82691
H  1.23669 -3.890568 -0.432362
H  2.302261 -4.021202 2.443942
H  1.010776 -5.014731 1.782945
H  2.656576 -5.21211 1.193768
H  2.579261 2.69282 0.889397
H  4.155434 2.897224 0.134124
H  -0.381736 -1.525703 -1.575593
H  1.461218 3.443776 -1.229847
H  2.600131 4.654404 -0.64653
H  3.043002 3.619848 -2.002735
H  -3.22745 1.39184 1.213016
H  -2.672686 -2.247925 -0.976738
totalener: -2636.99267557 hartree
nucrepener: 2150.29715464 hartree
electener: -4787.28983021 hartree
oneelecener: -7912.23155543 hartree
twoeener: 3124.94172522 hartree
kineticenergy: 2631.05226822 hartree
xcener: -154.158255258509 hartree
chargesum: -0.0000000
charge: -0.056050 -0.067641 -0.136245 -0.361182 0.592874 -0.343094 -0.313699 -0.089462 -0.120236 -0.243862 0.232087 0.019237 0.045526 -0.186492 -0.218807 -0.104947 -0.105857 0.054261 0.106972 0.116898 0.068463 0.066117 0.085344 0.088341 0.074699 0.080803 0.100657 0.131832 0.072911 0.083011 0.088628 0.116270 0.122642
qa: -0.0560 -0.0676 -0.1362 -0.3612 0.5929 -0.3431 -0.3137 -0.0895 -0.1202 -0.2439 0.2321 0.0192 0.0455 -0.1865 -0.2188 -0.1049 -0.1059 0.0543 0.1070 0.1169 0.0685 0.0661 0.0853 0.0883 0.0747 0.0808 0.1007 0.1318 0.0729 0.0830 0.0886 0.1163 0.1226
va: 1.2537 1.2344 2.3104 2.0802 5.4063 2.0881 2.1530 3.8323 3.8963 3.9557 3.8254 3.8878 3.9919 4.0050 3.9248 4.0219 4.0272 3.9511 1.0389 1.0106 1.0253 1.0120 1.0047 1.0065 1.0038 1.0169 0.9951 1.0174 1.0280 1.0094 1.0076 1.0183 1.0101
dispcorr: -0.018790328 hartree
energy: -2637.011465902475
dipole: 23.10427 -22.71963 0.38464 -12.78480 12.49001 -0.29479 -1.01487 0.63828 -0.37658
magnitude: 0.61373 au
magnitude: 1.55998 debye
