program: Orca
programVersion: 5.0.2
elementType: Cl Cl S S P O O C C C C C C C C C C C H H H H H H H H H H H H H H H
charge: 0
multiplicity: 1
keywords: wb97x-d3
keywords: def2-TZVPP
keywords: def2/J RIJCOSX
keywords: DEFGRID2
keywords: scfconv7
keywords: smallprint printgap noloewdin
keywords: NOSOSCF
formula: C11H15Cl2O2PS2
InChI: InChI=1/C11H15Cl2O2PS2/c1-3-7-18-16(17,14-4-2)15-11-6-5-9(12)8-10(11)13/h5-6,8H,3-4,7H2,1-2H3
33 atoms
Cl -0.464585 0.937764 -2.636424
Cl -4.88151 1.773556 0.293067
S  3.190418 -1.14892 -0.654718
S  1.631136 -0.410954 2.292474
P  1.672527 -0.20669 0.382066
O  0.348159 -0.772688 -0.401036
O  1.783702 1.277302 -0.192873
C  3.428003 -2.648701 0.363944
C  2.30976 -3.672502 0.272593
C  2.013572 -4.150057 -1.139193
C  -0.864645 -0.172841 -0.214544
C  1.883564 2.447085 0.633852
C  -1.371632 0.660319 -1.206615
C  -1.610704 -0.404837 0.930404
C  0.517941 2.99324 0.97794
C  -2.612811 1.257637 -1.054606
C  -2.849437 0.191372 1.093743
C  -3.339581 1.023443 0.100526
H  3.597066 -2.330771 1.392975
H  4.36569 -3.061169 -0.014792
H  2.606821 -4.520233 0.897109
H  1.407072 -3.266229 0.733614
H  2.906214 -4.555464 -1.618866
H  1.258834 -4.935816 -1.130122
H  1.638998 -3.339365 -1.763352
H  2.450053 2.217912 1.53909
H  2.458265 3.161255 0.045425
H  -1.215242 -1.058001 1.695379
H  0.62889 3.92454 1.534748
H  -0.063797 3.203648 0.080904
H  -0.042669 2.297599 1.60224
H  -3.001665 1.900264 -1.831442
H  -3.426865 0.009016 1.988633
totalener: -2636.99186824 hartree
nucrepener: 2166.42106411 hartree
electener: -4803.41293236 hartree
oneelecener: -7944.49767443 hartree
twoeener: 3141.08474208 hartree
kineticenergy: 2631.06065712 hartree
xcener: -154.161416590772 hartree
chargesum: -0.0000000
charge: -0.042969 -0.066660 -0.119164 -0.383140 0.598929 -0.322865 -0.330459 -0.142574 -0.100658 -0.237302 0.259035 0.026345 -0.032380 -0.170537 -0.243171 -0.098590 -0.115736 0.060400 0.130111 0.115624 0.075043 0.060669 0.073085 0.085882 0.084814 0.091680 0.099129 0.132029 0.095570 0.088914 0.087114 0.116426 0.125406
qa: -0.0430 -0.0667 -0.1192 -0.3831 0.5989 -0.3229 -0.3305 -0.1426 -0.1007 -0.2373 0.2590 0.0263 -0.0324 -0.1705 -0.2432 -0.0986 -0.1157 0.0604 0.1301 0.1156 0.0750 0.0607 0.0731 0.0859 0.0848 0.0917 0.0991 0.1320 0.0956 0.0889 0.0871 0.1164 0.1254
va: 1.2680 1.2353 2.3248 2.0569 5.3902 2.0929 2.1304 3.9055 3.8606 3.9344 3.7859 3.8746 4.0200 4.0240 3.9100 3.9883 4.0123 3.9366 1.0286 1.0039 1.0083 1.0279 1.0036 1.0067 1.0163 1.0144 0.9924 1.0165 1.0158 1.0043 1.0105 1.0222 1.0101
dispcorr: -0.019546933 hartree
energy: -2637.011415174778
dipole: 19.06665 -18.77650 0.29015 -13.34543 13.27617 -0.06927 8.00346 -7.82637 0.17709
magnitude: 0.34691 au
magnitude: 0.88178 debye
