program: Orca
programVersion: 5.0.2
elementType: Cl Cl S S P O O C C C C C C C C C C C H H H H H H H H H H H H H H H
charge: 0
multiplicity: 1
keywords: wb97x-d3
keywords: def2-TZVPP
keywords: def2/J RIJCOSX
keywords: DEFGRID2
keywords: scfconv7
keywords: smallprint printgap noloewdin
keywords: NOSOSCF
formula: C11H15Cl2O2PS2
InChI: InChI=1/C11H15Cl2O2PS2/c1-3-7-18-16(17,14-4-2)15-11-6-5-9(12)8-10(11)13/h5-6,8H,3-4,7H2,1-2H3
33 atoms
Cl -1.696027 -0.07349 2.542386
Cl -4.762692 -0.850111 -1.789648
S  1.822724 -0.994153 -0.844288
S  2.973842 1.014263 1.659988
P  1.753867 0.803317 0.206646
O  0.209677 1.017289 0.67496
O  1.835477 1.866301 -0.991361
C  2.221552 -2.162557 0.505654
C  1.076767 -2.442469 1.46287
C  -0.151744 -3.048938 0.805933
C  -0.917907 0.592451 0.048477
C  3.0637 2.507985 -1.364384
C  -1.92713 0.05682 0.844643
C  -1.12059 0.692841 -1.320547
C  3.983907 1.599394 -2.146298
C  -3.115319 -0.379992 0.284228
C  -2.300876 0.248055 -1.891039
C  -3.291026 -0.288637 -1.085905
H  3.095222 -1.773617 1.028907
H  2.524846 -3.068984 -0.022549
H  1.459939 -3.126775 2.225685
H  0.815065 -1.526876 1.99599
H  -0.944114 -3.201717 1.537725
H  -0.550865 -2.406201 0.020978
H  0.075554 -4.016745 0.355674
H  2.756656 3.363355 -1.965069
H  3.559424 2.884258 -0.467177
H  -0.359402 1.12776 -1.952244
H  3.483917 1.172959 -3.015484
H  4.840186 2.174827 -2.499234
H  4.362004 0.782464 -1.532887
H  -3.888381 -0.794613 0.91504
H  -2.446047 0.323583 -2.959122
totalener: -2636.99091097 hartree
nucrepener: 2175.56447848 hartree
electener: -4812.55538945 hartree
oneelecener: -7962.57005441 hartree
twoeener: 3150.01466496 hartree
kineticenergy: 2631.05097119 hartree
xcener: -154.165019303090 hartree
chargesum: 0.0000000
charge: -0.047207 -0.067819 -0.152980 -0.350376 0.592711 -0.299772 -0.326229 -0.123157 -0.103920 -0.248108 0.178104 0.001409 -0.001319 -0.128325 -0.231534 -0.090221 -0.129865 0.059715 0.132104 0.113279 0.079127 0.060402 0.091706 0.069827 0.089434 0.095151 0.098479 0.138437 0.085945 0.090344 0.088044 0.114387 0.122227
qa: -0.0472 -0.0678 -0.1530 -0.3504 0.5927 -0.2998 -0.3262 -0.1232 -0.1039 -0.2481 0.1781 0.0014 -0.0013 -0.1283 -0.2315 -0.0902 -0.1299 0.0597 0.1321 0.1133 0.0791 0.0604 0.0917 0.0698 0.0894 0.0952 0.0985 0.1384 0.0859 0.0903 0.0880 0.1144 0.1222
va: 1.2655 1.2346 2.2908 2.1143 5.4060 2.1642 2.1101 3.8940 3.8505 3.9256 3.9079 3.8999 3.9437 3.9246 3.8821 3.9937 4.0445 3.9447 1.0294 1.0058 1.0136 1.0414 1.0090 1.0090 1.0092 0.9911 1.0141 1.0221 1.0047 1.0137 1.0175 1.0239 1.0122
dispcorr: -0.020431940 hartree
energy: -2637.011342911395
dipole: 24.58551 -24.13239 0.45313 -6.99928 6.69073 -0.30855 -7.21012 6.18500 -1.02511
magnitude: 1.16249 au
magnitude: 2.95482 debye
