program: Orca
programVersion: 5.0.2
elementType: Cl Cl S S P O O C C C C C C C C C C C H H H H H H H H H H H H H H H
charge: 0
multiplicity: 1
keywords: wb97x-d3
keywords: def2-TZVPP
keywords: def2/J RIJCOSX
keywords: DEFGRID2
keywords: scfconv7
keywords: smallprint printgap noloewdin
keywords: NOSOSCF
formula: C11H15Cl2O2PS2
InChI: InChI=1/C11H15Cl2O2PS2/c1-3-7-18-16(17,14-4-2)15-11-6-5-9(12)8-10(11)13/h5-6,8H,3-4,7H2,1-2H3
33 atoms
Cl -0.655436 1.581195 -2.399236
Cl -5.023852 1.588667 0.711861
S  3.057231 -0.97904 -0.979227
S  1.520291 -0.715365 2.060749
P  1.555723 -0.19654 0.209482
O  0.226922 -0.615729 -0.654713
O  1.674052 1.362684 -0.104844
C  3.36245 -2.565529 -0.127588
C  2.281224 -3.60911 -0.342847
C  2.636585 -4.920805 0.34389
C  -0.992494 -0.100869 -0.318167
C  1.749113 2.379207 0.905944
C  -1.530421 0.93883 -1.069567
C  -1.713538 -0.619693 0.74638
C  0.373654 2.869628 1.290632
C  -2.777171 1.456817 -0.757776
C  -2.957564 -0.10608 1.068762
C  -3.477131 0.93474 0.316613
H  3.51471 -2.357344 0.932375
H  4.317313 -2.900435 -0.53816
H  1.333837 -3.237935 0.05182
H  2.133844 -3.766051 -1.412866
H  3.570704 -5.33527 -0.037872
H  2.748449 -4.786251 1.420403
H  1.858278 -5.666364 0.185206
H  2.284809 1.999363 1.778073
H  2.343353 3.177289 0.462846
H  -1.292887 -1.431896 1.322093
H  -0.213008 2.07951 1.75936
H  0.465742 3.68596 2.00759
H  -0.171765 3.2421 0.424419
H  -3.190225 2.262315 -1.347639
H  -3.515169 -0.512398 1.900345
totalener: -2636.99173421 hartree
nucrepener: 2151.96303192 hartree
electener: -4788.95476613 hartree
oneelecener: -7915.55163996 hartree
twoeener: 3126.59687383 hartree
kineticenergy: 2631.06443913 hartree
xcener: -154.161198822170 hartree
chargesum: -0.0000000
charge: -0.043718 -0.067028 -0.116430 -0.386916 0.599588 -0.320292 -0.330936 -0.123414 -0.090618 -0.246249 0.241551 0.025413 -0.023296 -0.155031 -0.240854 -0.096801 -0.120076 0.059135 0.116750 0.114554 0.059380 0.070174 0.074661 0.082681 0.088036 0.091892 0.099152 0.127907 0.085887 0.096792 0.086556 0.115884 0.125668
qa: -0.0437 -0.0670 -0.1164 -0.3869 0.5996 -0.3203 -0.3309 -0.1234 -0.0906 -0.2462 0.2416 0.0254 -0.0233 -0.1550 -0.2409 -0.0968 -0.1201 0.0591 0.1168 0.1146 0.0594 0.0702 0.0747 0.0827 0.0880 0.0919 0.0992 0.1279 0.0859 0.0968 0.0866 0.1159 0.1257
va: 1.2660 1.2352 2.3346 2.0529 5.3846 2.1012 2.1334 3.8956 3.8703 3.9420 3.8081 3.8778 4.0176 4.0221 3.9109 3.9952 4.0177 3.9371 1.0304 1.0068 1.0292 1.0178 1.0038 1.0046 1.0062 1.0143 0.9920 1.0162 1.0101 1.0153 1.0072 1.0228 1.0105
dispcorr: -0.019130545 hartree
energy: -2637.010864757824
dipole: 21.20189 -20.88436 0.31753 -17.03540 16.90010 -0.13530 10.30552 -10.10642 0.19909
magnitude: 0.39846 au
magnitude: 1.01280 debye
