program: Orca
programVersion: 5.0.2
elementType: Cl Cl S S P O O C C C C C C C C C C C H H H H H H H H H H H H H H H
charge: 0
multiplicity: 1
keywords: wb97x-d3
keywords: def2-TZVPP
keywords: def2/J RIJCOSX
keywords: DEFGRID2
keywords: scfconv7
keywords: smallprint printgap noloewdin
keywords: NOSOSCF
formula: C11H15Cl2O2PS2
InChI: InChI=1/C11H15Cl2O2PS2/c1-3-7-18-16(17,14-4-2)15-11-6-5-9(12)8-10(11)13/h5-6,8H,3-4,7H2,1-2H3
33 atoms
Cl -0.389972 1.670221 -2.032609
Cl -4.428007 -1.520566 -0.501236
S  2.211842 -0.59539 -0.998869
S  2.276607 -0.601166 2.41959
P  2.048585 0.422469 0.822949
O  0.613426 1.210221 0.670926
O  3.026789 1.668346 0.724401
C  2.405167 -2.32981 -0.459086
C  1.082383 -3.02066 -0.184413
C  1.291921 -4.474482 0.214823
C  -0.545611 0.54682 0.411792
C  3.044762 2.598116 -0.371163
C  -1.138077 0.683664 -0.839216
C  -1.168185 -0.224637 1.380855
C  2.365509 3.894272 0.002837
C  -2.335581 0.049822 -1.125929
C  -2.363926 -0.865262 1.104648
C  -2.937231 -0.726325 -0.148852
H  3.061689 -2.350774 0.410885
H  2.936022 -2.804474 -1.286864
H  0.560116 -2.49205 0.614731
H  0.44648 -2.957232 -1.069916
H  1.897234 -4.551903 1.118933
H  0.339225 -4.963973 0.414363
H  1.793856 -5.041465 -0.570753
H  4.098705 2.760114 -0.596196
H  2.585916 2.16551 -1.264305
H  -0.710965 -0.317698 2.356399
H  2.500708 4.616102 -0.803247
H  1.296861 3.759638 0.156565
H  2.797843 4.319332 0.907833
H  -2.789009 0.162387 -2.100306
H  -2.84642 -1.465771 1.86239
totalener: -2636.99141609 hartree
nucrepener: 2178.02379127 hartree
electener: -4815.01520736 hartree
oneelecener: -7967.41585574 hartree
twoeener: 3152.40064837 hartree
kineticenergy: 2631.04849568 hartree
xcener: -154.159956216419 hartree
chargesum: 0.0000000
charge: -0.057582 -0.066153 -0.175505 -0.353949 0.601574 -0.333963 -0.308418 -0.089851 -0.084583 -0.250539 0.216243 0.010299 0.036966 -0.188210 -0.224955 -0.111920 -0.106811 0.057662 0.111739 0.115026 0.051895 0.070251 0.084373 0.088283 0.076760 0.102966 0.078944 0.147652 0.081988 0.082000 0.091836 0.118729 0.127257
qa: -0.0576 -0.0662 -0.1755 -0.3539 0.6016 -0.3340 -0.3084 -0.0899 -0.0846 -0.2505 0.2162 0.0103 0.0370 -0.1882 -0.2250 -0.1119 -0.1068 0.0577 0.1117 0.1150 0.0519 0.0703 0.0844 0.0883 0.0768 0.1030 0.0789 0.1477 0.0820 0.0820 0.0918 0.1187 0.1273
va: 1.2535 1.2356 2.3011 2.0965 5.4162 2.0905 2.1655 3.8806 3.8779 3.9613 3.8056 3.9130 3.9700 3.9936 3.9115 4.0198 3.9960 3.9446 1.0366 1.0075 1.0268 1.0156 1.0038 1.0061 1.0041 0.9976 1.0010 1.0129 1.0093 1.0221 1.0069 1.0181 1.0085
dispcorr: -0.019556294 hartree
energy: -2637.010972384254
dipole: 18.10396 -18.09185 0.01211 -8.19909 8.17568 -0.02341 2.67974 -3.44385 -0.76411
magnitude: 0.76456 au
magnitude: 1.94337 debye
