program: Gaussian 09
title: 000066478
version: EM64L-G09RevD.01
frameworkgroup: C1[X(C21H12BrNO3)]
method: RPBEPBE
basis: SDD
operation: Freq
keyword: #p
keyword: freq=noraman
keyword: PBEPBE/SDD
title: #p freq=noraman PBEPBE/SDD
converged: YES YES NO NO
title: Mulliken charges:
elementType: Br O O O N C C C C C C C C C C C C C C C C C C C C C H H H H H H H H H H H H
charge: 0.079793 -0.309722 -0.171721 -0.266081 -0.488412 0.018752 0.436763 0.284043 0.270271 0.334044 -0.081830 -0.229819 -0.445837 -0.351966 -0.374005 -0.376011 -0.168201 -0.227002 -0.223894 0.137100 0.227588 -0.326390 -0.318076 -0.228921 -0.254329 -0.224418 0.329778 0.291880 0.295975 0.261970 0.387762 0.242381 0.243236 0.276346 0.248082 0.234093 0.232439 0.234339
chargesum: 0.00000
title: Mulliken charges with hydrogens summed into heavy atoms:
elementType: Br O O O N C C C C C C C C C C C C C C C C C C C C C
charge: 0.079793 -0.309722 -0.171721 -0.266081 -0.100650 0.018752 0.436763 0.284043 0.270271 0.334044 -0.081830 -0.229819 -0.445837 -0.022188 -0.082125 -0.080037 0.093769 0.015379 0.019343 0.137100 0.227588 -0.050044 -0.069995 0.005172 -0.021890 0.009921
polarizability: 4.51871289e+02 -1.23671156e+01 3.65034768e+02 -5.26114078e-01 8.65734456e-01 9.23789878e+01
1716.lowfreq: -0.0005 -0.0002 0.0004 3.1109 6.7991 7.3530 13.4701 27.3031 27.8359
frequency: 13.0936 27.2457 27.8248 45.4907 61.8392 75.2111 114.7099 135.4912 145.3186 160.8206 171.2068 183.4426 204.6563 246.0143 246.4874 302.8317 332.8237 338.0368 372.6991 379.3804 398.6617 419.4687 424.0772 427.9069 450.3033 452.4018 472.5421 485.0655 496.6292 567.9331 592.2290 614.3196 628.0391 646.7001 664.3383 686.8287 698.0093 699.5717 704.2333 732.2086 742.1190 787.4103 798.9590 810.7117 852.8222 862.4607 863.0640 867.3494 868.5567 910.3383 937.6350 938.6068 977.7801 986.3493 988.8876 998.2540 1000.6446 1010.3390 1011.5524 1017.3442 1027.7219 1037.6600 1086.8895 1089.9366 1101.9805 1113.6164 1166.8725 1170.7734 1174.0902 1182.8761 1204.6909 1243.7876 1251.8495 1274.5371 1291.7108 1299.2857 1334.3299 1362.7399 1371.3841 1387.7223 1393.7640 1406.8443 1435.9898 1444.9572 1469.7176 1480.8647 1488.3233 1516.3342 1551.4828 1557.8221 1582.1073 1588.5305 1605.0987 1610.0974 1612.0638 1629.7316 3111.5635 3130.1840 3138.7981 3139.5815 3149.6443 3155.8559 3161.0688 3162.7884 3168.2582 3171.4819 3176.4698 3188.8853
redmass: 3.9643 10.9872 6.9669 8.2171 6.1683 6.8945 4.7196 12.4348 6.7532 8.6601 7.2439 5.5993 7.4874 7.5264 6.4634 7.8289 5.5584 8.9016 8.2951 8.2461 2.7846 3.4764 5.2950 12.3226 3.8276 8.3426 9.1052 8.8897 4.3922 4.5302 7.4466 6.4393 7.3860 7.1089 4.7477 4.1523 8.1229 1.5667 6.7875 2.8488 3.8622 7.8199 2.4080 1.9074 1.2619 1.6550 7.2460 7.3571 2.2300 6.5456 1.8944 1.4493 1.2217 6.8568 6.1391 1.2862 1.3776 1.3182 1.3351 1.3674 2.4047 2.0246 1.8465 2.3750 2.7482 2.9339 2.2048 1.1175 1.0663 1.5543 1.1444 1.7564 3.2360 2.4367 3.7062 2.6226 1.4375 7.5323 5.3806 7.8837 3.9573 9.2469 2.2923 2.7025 3.5106 2.8478 2.6498 5.7715 8.8690 7.4150 6.8808 4.1311 7.1726 6.8435 6.2304 2.1422 1.0842 1.0850 1.0882 1.0867 1.0927 1.0908 1.0960 1.0910 1.0948 1.1007 1.0994 1.0963
irintensity: 0.0178 3.0796 0.2027 0.0659 0.7574 5.8020 0.5254 0.4808 1.5704 0.4369 0.3065 0.2398 2.2624 0.9229 0.4824 15.0171 0.1483 4.3172 5.4559 2.7629 0.0076 0.6626 0.1759 16.7271 0.3517 3.5064 7.5694 2.1166 1.0557 28.0055 15.0265 0.9465 14.1450 2.5030 1.7944 0.2790 3.0602 91.6274 25.0834 27.3432 7.6746 37.3327 25.1514 39.6389 2.4453 24.6333 10.1794 17.1329 16.3353 8.4175 2.1502 1.9864 60.9813 102.8441 14.2249 15.5473 12.1211 3.7212 2.3356 0.0166 7.9293 4.5096 34.3798 0.2917 1.5620 37.5694 7.6552 1.4646 10.6276 55.8188 30.3973 16.2265 281.9585 292.9212 380.0041 307.1868 52.9966 4.7561 178.5874 3.4918 44.4436 14.6478 4.0399 14.9280 201.9083 416.2257 143.6807 205.0095 109.8086 325.4932 44.2366 137.5032 19.0630 12.5063 0.1503 154.9120 142.6082 1.6864 12.1802 3.6110 8.4656 8.7021 10.2088 5.8786 2.3746 35.3849 25.2136 24.2589
temp: 298.150 k
press: 1.00000 atm
elementType: 35 8 8 8 7 6 6 6 6 6 6 6 6 6 6 6 6 6 6 6 6 6 6 6 6 6 1 1 1 1 1 1 1 1 1 1 1 1
symmnumber: 1
zpe: 714649.3 jmol-1
zpe.correction: 0.272196 hartree
zpe.thermalcorrener: 0.292746 hartree
zpe.thermalcorrenthalpy: 0.293691 hartree
zpe.thermalcorrgfe: 0.219525 hartree
zpe.sumelectzpe: -1099.610524 hartree
zpe.sumelectthermal: -1099.589973 hartree
zpe.sumelectthermalent: -1099.589029 hartree
zpe.sumelectthermalfe: -1099.663195 hartree
dipole: 2.0903 4.1043 -0.0003
dipole: 4.6059
quadrupole: -148.5285 -136.5697 -163.3963
quadrupole: -2.0999 0.1770 0.1333
quadrupole: 0.9697 12.9285 -13.8982 -2.0999 0.1770 0.1333
hfenergy: -1099.8827195 hartree
pointgroup: C01 [X(C21H12Br1N1O3)]
dipole: -0.4085595 1.7623518 0.1045051 debye
polarizability: 452.6076572|-9.4335862|363.4048447|0.2845715|15.5752619|93.2725424 unknown
InChI: InChI=1S/C21H12BrNO3/c22-15-10-11-16(23-21(26)12-6-2-1-3-7-12)18-17(15)19(24)13-8-4-5-9-14(13)20(18)25/h1-11,23H
charge 0 multiplicity 1
38 atoms
Br 3.603819 -3.978766 -0.222787
O  -0.185678 1.561021 0.105784
O  4.559707 -1.231239 -0.065397
O  -3.194307 -2.296177 -0.121833
N  -1.574159 -0.588615 -0.027745
C  0.882266 -0.618689 -0.023659
C  2.12791 -1.362417 -0.067604
C  2.197331 1.578354 0.12024
C  3.420368 0.861073 0.076826
C  -0.382579 -1.320928 -0.069162
C  0.902647 0.862016 0.068315
C  3.442713 -0.629507 -0.022235
C  2.063395 -2.777108 -0.15381
C  -0.388285 -2.744828 -0.156538
C  2.208991 2.993946 0.213469
C  4.649537 1.56408 0.126398
C  0.815391 -3.44832 -0.196898
C  3.433243 3.686594 0.262901
C  4.657236 2.969379 0.219237
C  -2.895947 -1.062345 -0.058046
C  -3.963409 -0.00021 -0.008998
C  -5.308889 -0.455136 -0.009181
C  -3.704981 1.397731 0.032489
C  -6.37683 0.462301 0.03216
C  -4.777604 2.314183 0.073319
C  -6.114201 1.852251 0.073603
H  -1.348226 -3.262449 -0.18999
H  1.250718 3.520076 0.245133
H  5.577308 0.985222 0.09043
H  0.799177 -4.539954 -0.263026
H  -1.392706 0.438259 0.035113
H  3.44194 4.779204 0.334899
H  5.608787 3.510014 0.257759
H  -5.483965 -1.535222 -0.043138
H  -2.685741 1.799276 0.031435
H  -7.409786 0.098148 0.031929
H  -4.569458 3.38907 0.104186
H  -6.942534 2.568714 0.105226
