program: Orca
programVersion: 5.0.2
elementType: Cl Cl S S P O O C C C C C C C C C C C H H H H H H H H H H H H H H H
charge: 0
multiplicity: 1
keywords: wb97x-d3
keywords: def2-TZVPP
keywords: def2/J RIJCOSX
keywords: DEFGRID2
keywords: scfconv7
keywords: smallprint printgap noloewdin
keywords: NOSOSCF
formula: C11H15Cl2O2PS2
InChI: InChI=1/C11H15Cl2O2PS2/c1-3-7-18-16(17,14-4-2)15-11-6-5-9(12)8-10(11)13/h5-6,8H,3-4,7H2,1-2H3
33 atoms
Cl -1.768884 -0.668359 2.350866
Cl -4.90347 0.16789 -1.921618
S  1.559672 -0.968781 -0.970663
S  2.914215 0.424047 1.839853
P  1.684007 0.604006 0.392497
O  0.173074 0.913664 0.904352
O  1.890488 1.850198 -0.601059
C  2.075718 -2.381478 0.064045
C  1.015408 -2.843634 1.045405
C  1.452571 -4.095424 1.792699
C  -0.974851 0.739764 0.193942
C  3.167628 2.081774 -1.211197
C  -1.999273 0.008605 0.789039
C  -1.182464 1.297628 -1.058895
C  3.103013 3.386722 -1.965388
C  -3.210961 -0.167073 0.141716
C  -2.387405 1.120428 -1.716994
C  -3.395408 0.388228 -1.112969
H  3.003044 -2.109439 0.569942
H  2.309898 -3.163342 -0.661727
H  0.814468 -2.044954 1.760967
H  0.080787 -3.029278 0.512441
H  1.639598 -4.926736 1.110963
H  2.366046 -3.919306 2.362015
H  0.683668 -4.414104 2.495743
H  3.936499 2.113605 -0.435978
H  3.402987 1.252404 -1.883654
H  -0.405849 1.889455 -1.521132
H  4.068063 3.582561 -2.432387
H  2.351423 3.357747 -2.753335
H  2.877143 4.2186 -1.300203
H  -3.998861 -0.73375 0.616653
H  -2.539765 1.55841 -2.69306
totalener: -2636.99293752 hartree
nucrepener: 2134.29172250 hartree
electener: -4771.28466002 hartree
oneelecener: -7879.99515260 hartree
twoeener: 3108.71049259 hartree
kineticenergy: 2631.04226787 hartree
xcener: -154.158146990800 hartree
chargesum: -0.0000000
charge: -0.047931 -0.067558 -0.160811 -0.349188 0.598524 -0.302911 -0.327854 -0.098610 -0.089176 -0.248882 0.156671 0.018738 0.019949 -0.119333 -0.235048 -0.102773 -0.132475 0.064432 0.116697 0.111842 0.050326 0.070427 0.074233 0.083986 0.089596 0.098046 0.088092 0.148134 0.083543 0.079968 0.091467 0.116031 0.121847
qa: -0.0479 -0.0676 -0.1608 -0.3492 0.5985 -0.3029 -0.3279 -0.0986 -0.0892 -0.2489 0.1567 0.0187 0.0199 -0.1193 -0.2350 -0.1028 -0.1325 0.0644 0.1167 0.1118 0.0503 0.0704 0.0742 0.0840 0.0896 0.0980 0.0881 0.1481 0.0835 0.0800 0.0915 0.1160 0.1218
va: 1.2633 1.2348 2.2999 2.1187 5.4097 2.1595 2.1153 3.8833 3.8695 3.9640 3.9258 3.8659 3.9638 3.9334 3.9621 4.0193 4.0407 3.9427 1.0322 1.0071 1.0371 1.0139 1.0035 1.0033 1.0064 1.0066 0.9989 1.0114 1.0084 1.0040 1.0063 1.0224 1.0119
dispcorr: -0.018116862 hartree
energy: -2637.011054377187
dipole: 27.13064 -26.72017 0.41047 -6.26237 6.09756 -0.16481 -5.52277 4.35706 -1.16571
magnitude: 1.24681 au
magnitude: 3.16914 debye
