program: Orca
programVersion: 5.0.2
elementType: Cl Cl S S P O O C C C C C C C C C C C H H H H H H H H H H H H H H H
charge: 0
multiplicity: 1
keywords: wb97x-d3
keywords: def2-TZVPP
keywords: def2/J RIJCOSX
keywords: DEFGRID2
keywords: scfconv7
keywords: smallprint printgap noloewdin
keywords: NOSOSCF
formula: C11H15Cl2O2PS2
InChI: InChI=1/C11H15Cl2O2PS2/c1-3-7-18-16(17,14-4-2)15-11-6-5-9(12)8-10(11)13/h5-6,8H,3-4,7H2,1-2H3
33 atoms
Cl -0.996259 0.672844 -2.650861
Cl -5.379088 0.006766 0.374913
S  1.229145 -1.421018 -0.987196
S  1.592961 -0.282052 2.227991
P  1.526509 0.13539 0.352116
O  0.340145 1.166487 -0.105855
O  2.771913 0.935869 -0.239327
C  1.689663 -2.900729 -0.018183
C  3.113335 -3.374911 -0.25537
C  4.182725 -2.397523 0.203001
C  -0.983257 0.866702 0.03495
C  3.541678 1.846873 0.560499
C  -1.742349 0.623827 -1.105298
C  -1.594584 0.849273 1.279054
C  2.789748 3.114477 0.896871
C  -3.098835 0.361257 -1.004942
C  -2.948595 0.583701 1.390486
C  -3.690333 0.337436 0.246903
H  0.97034 -3.657442 -0.333336
H  1.500174 -2.689354 1.035524
H  3.224679 -4.321128 0.282683
H  3.248923 -3.60891 -1.313671
H  4.161922 -1.480685 -0.385992
H  4.050917 -2.125279 1.250514
H  5.175005 -2.83372 0.091308
H  3.871427 1.338244 1.469249
H  4.420215 2.064251 -0.045165
H  -1.005224 1.047403 2.163051
H  1.957913 2.922493 1.573774
H  3.465021 3.810124 1.395793
H  2.404418 3.600552 0.001726
H  -3.681445 0.174911 -1.895657
H  -3.42111 0.569224 2.362137
totalener: -2636.99181726 hartree
nucrepener: 2149.68953678 hartree
electener: -4786.68135403 hartree
oneelecener: -7911.16738278 hartree
twoeener: 3124.48602874 hartree
kineticenergy: 2631.06029518 hartree
xcener: -154.163204693842 hartree
chargesum: -0.0000000
charge: -0.048414 -0.069185 -0.135802 -0.386415 0.614525 -0.338367 -0.314791 -0.121197 -0.080345 -0.260717 0.225313 0.017423 -0.017908 -0.139744 -0.225325 -0.089766 -0.120164 0.049900 0.114932 0.118199 0.067241 0.064924 0.076730 0.082176 0.091531 0.092565 0.099823 0.134625 0.079357 0.085894 0.092840 0.116238 0.123903
qa: -0.0484 -0.0692 -0.1358 -0.3864 0.6145 -0.3384 -0.3148 -0.1212 -0.0803 -0.2607 0.2253 0.0174 -0.0179 -0.1397 -0.2253 -0.0898 -0.1202 0.0499 0.1149 0.1182 0.0672 0.0649 0.0767 0.0822 0.0915 0.0926 0.0998 0.1346 0.0794 0.0859 0.0928 0.1162 0.1239
va: 1.2637 1.2330 2.3413 2.0522 5.3855 2.1220 2.1204 3.8813 3.8710 3.9306 3.8430 3.8801 4.0289 4.0301 3.9063 4.0024 4.0245 3.9436 1.0078 1.0437 1.0106 1.0126 1.0146 1.0116 1.0100 1.0105 0.9899 1.0157 1.0205 1.0110 1.0076 1.0204 1.0107
dispcorr: -0.018042077 hartree
energy: -2637.009859335268
dipole: 35.40539 -34.67592 0.72947 -5.85204 5.75836 -0.09368 9.90992 -9.76439 0.14552
magnitude: 0.74972 au
magnitude: 1.90564 debye
