program: Gaussian 09
title: 000066439
version: EM64L-G09RevD.01
frameworkgroup: C1[X(C19H24O2)]
method: RPBEPBE
basis: SDD
operation: Freq
keyword: #pfreq=noraman
keyword: PBEPBE/SDD
title: #p freq=noraman PBEPBE/SDD
converged: YES YES NO NO
title: Mulliken charges:
elementType: O O C C C C C C C C C C C C C C C C C C C H H H H H H H H H H H H H H H H H H H H H H H H
charge: -0.444170 -0.438682 0.437394 -0.164867 -0.109533 -0.163512 -0.533886 -0.384489 -0.718016 -0.486358 -0.510590 0.628327 -0.808374 0.256332 -0.579828 0.300466 -0.824851 -0.345714 -0.539479 -0.447167 0.286864 0.224391 0.238232 0.203773 0.191105 0.227456 0.208427 0.226819 0.236881 0.226722 0.191264 0.221595 0.216126 0.252629 0.215149 0.228074 0.223314 0.227665 0.341763 0.207696 0.234072 0.222415 0.254929 0.217556 0.352079
chargesum: 0.00000
title: Mulliken charges with hydrogens summed into heavy atoms:
elementType: O O C C C C C C C C C C C C C C C C C C C
charge: -0.102407 -0.086603 0.437394 0.059524 0.128699 0.040260 -0.115326 -0.176062 -0.254316 -0.068372 -0.072869 0.628327 -0.112522 0.256332 -0.128849 0.300466 -0.383083 -0.123299 -0.284550 -0.229611 0.286864
polarizability: 2.86372799e+02 -1.33393679e+01 1.98483809e+02 5.77427238e+00 6.21346836e+00 1.29188519e+02
1716.lowfreq: -15.3686 -5.6151 -0.0007 -0.0007 -0.0005 7.8501 29.2259 55.3543 66.9636
frequency: 29.1148 55.3531 66.9493 99.8171 111.8526 153.8525 183.7587 188.8904 206.6295 214.5393 232.3231 234.2676 261.0657 272.4085 291.1329 299.3406 337.7780 342.5866 358.3449 370.6616 399.2913 408.3892 436.3513 442.9659 455.7340 481.0203 501.8508 513.8403 520.7650 556.6623 565.3799 600.1535 616.3558 630.6643 680.3211 708.6557 723.4330 757.4059 776.6806 807.9579 823.2846 835.1660 847.3329 857.4051 885.3000 904.3603 912.9584 916.4618 924.2292 927.3272 938.2435 962.7940 982.6166 993.2765 1018.3898 1019.8836 1031.5012 1053.5689 1073.4031 1089.1962 1103.2117 1121.1937 1132.6056 1136.4850 1145.9713 1154.6511 1163.1349 1176.0492 1178.4504 1188.9763 1199.2933 1213.7829 1228.5260 1238.1462 1242.9530 1250.5090 1257.1617 1266.1048 1277.4409 1284.7283 1289.0059 1306.9392 1315.7145 1327.4382 1334.4494 1336.5072 1342.7848 1353.4710 1357.6213 1381.0270 1385.5305 1389.9737 1430.6286 1442.0414 1454.9204 1458.1837 1462.2372 1469.2396 1470.5465 1484.9876 1487.8480 1494.8597 1586.6038 1631.1601 1681.6273 2891.0900 2894.7718 2912.0093 2957.3473 2958.0921 2959.6227 2971.7197 2980.4303 2986.7311 2997.9855 3020.5497 3031.0683 3034.6066 3043.3536 3044.7196 3075.6609 3086.3251 3097.7411 3111.3557 3141.0476 3150.3878 3175.2352 3570.3304 3582.1401
redmass: 4.3234 4.6524 2.9759 4.0894 4.5853 1.8907 2.4577 1.1262 2.3414 3.4200 3.6573 2.1252 2.4905 3.5791 2.7531 2.9177 3.5869 1.1206 2.3864 3.0592 3.6430 3.3018 3.8625 2.8064 3.6779 2.5888 4.1569 2.8920 3.8279 2.8582 3.3966 1.8390 3.3938 2.7268 1.6260 3.9246 4.2182 2.8103 1.9544 1.8402 2.2704 2.4392 1.9849 2.2659 1.5936 2.0958 1.7232 1.9473 1.7679 1.4687 1.6658 1.7321 2.0201 2.2146 2.1235 3.9170 1.9424 2.8278 2.7829 1.7379 2.1550 1.8833 1.3986 2.0375 1.5819 1.2845 1.6093 1.4849 1.4292 1.3577 1.8197 1.9787 1.8650 1.6732 1.5935 1.4920 2.6419 1.4559 1.4582 1.4198 1.4509 1.5557 1.3715 1.4661 1.4607 1.5304 1.4270 1.4700 1.6087 2.6320 2.0580 1.2307 1.1716 2.9317 1.0829 1.1737 1.0806 1.0830 1.0955 1.0657 1.0614 2.7054 7.1719 6.4484 5.9771 1.0813 1.0801 1.0802 1.0651 1.0655 1.0747 1.0693 1.0629 1.0602 1.0368 1.0936 1.0955 1.1017 1.1014 1.0991 1.0641 1.0977 1.0988 1.0890 1.0915 1.0935 1.1119 1.0661 1.0660
irintensity: 0.0973 0.2565 1.4197 0.3350 1.2645 1.0453 1.1088 137.3005 4.5372 0.8332 1.0717 2.4502 4.9861 4.4316 2.7280 2.7275 12.7887 135.8035 4.1191 1.3873 3.1071 3.9154 2.5249 2.6702 2.6441 0.6568 0.3577 3.1072 2.1287 10.0620 1.1883 1.7140 7.8962 2.7436 0.5929 1.7051 3.4275 8.4020 22.0594 21.4855 4.3876 0.6824 7.5382 4.0352 14.6704 54.6060 67.4180 1.1855 13.9021 3.0867 23.0578 16.3666 11.5529 4.9084 5.7737 79.0219 0.9055 13.2726 14.4162 12.3064 15.2552 20.6997 20.1720 7.4594 63.5215 34.2552 13.1757 24.2417 35.4544 2.3627 20.3094 12.8002 0.6616 2.2076 11.7216 2.3431 22.3895 4.7359 24.1304 14.8323 2.0010 4.5909 0.8916 0.6795 1.6545 1.9290 0.3184 1.8805 4.0736 19.1714 3.9892 24.2773 8.2048 6.4129 5.4850 7.7408 13.3150 9.8281 6.4519 2.6428 8.9678 101.2502 29.1122 50.7400 24.6381 31.6350 10.6313 33.6700 38.3368 21.0037 13.6721 52.6247 18.6935 28.9801 22.0805 35.8588 35.5085 48.2099 36.8159 54.8286 17.1197 32.1691 23.8874 21.5675 11.9225 14.3080 17.9527 1.7856 37.8295
temp: 298.150 k
press: 1.00000 atm
elementType: 8 8 6 6 6 6 6 6 6 6 6 6 6 6 6 6 6 6 6 6 6 1 1 1 1 1 1 1 1 1 1 1 1 1 1 1 1 1 1 1 1 1 1 1 1
symmnumber: 1
zpe: 1006061.1 jmol-1
zpe.correction: 0.383188 hartree
zpe.thermalcorrener: 0.402261 hartree
zpe.thermalcorrenthalpy: 0.403205 hartree
zpe.thermalcorrgfe: 0.337338 hartree
zpe.sumelectzpe: -887.281810 hartree
zpe.sumelectthermal: -887.262738 hartree
zpe.sumelectthermalent: -887.261794 hartree
zpe.sumelectthermalfe: -887.327661 hartree
dipole: -0.5251 -0.1876 -1.2977
dipole: 1.4124
quadrupole: -120.8360 -121.1000 -129.2445
quadrupole: -14.2730 3.7061 2.7317
quadrupole: 2.8908 2.6268 -5.5177 -14.2730 3.7061 2.7317
hfenergy: -887.6649989 hartree
pointgroup: C01 [X(C19H24O2)]
dipole: 0.2066361 -0.0685585 0.5112556 debye
polarizability: 286.5214367|12.9365234|198.1791457|5.4441123|-7.1115954|129.3445452 unknown
InChI: InChI=1S/C19H24O2/c1-11-9-17-16-5-3-12-10-13(20)4-6-14(12)15(16)7-8-19(17,2)18(11)21/h4,6,10,15-18,20-21H,1,3,5,7-9H2,2H3
charge 0 multiplicity 1
45 atoms
O  4.748163 -1.571159 -0.24223
O  -6.215775 0.090048 -0.399414
C  2.380809 -0.795559 -0.131341
C  1.755259 0.543644 0.387237
C  0.285138 0.69943 -0.031722
C  -0.528589 -0.489046 0.572819
C  1.596154 -1.970487 0.493401
C  3.836385 -0.610534 0.38063
C  2.796055 1.623552 -0.01106
C  0.078256 -1.868952 0.179926
C  -0.350928 2.031227 0.42047
C  4.13399 0.879212 0.105537
C  2.405717 -0.911754 -1.678456
C  -2.030745 -0.354886 0.27058
C  -1.762969 2.177001 -0.180382
C  -2.610569 0.913206 -0.04403
C  5.369941 1.415381 -0.017599
C  -2.895524 -1.475929 0.353933
C  -4.003652 1.019667 -0.260172
C  -4.285457 -1.373967 0.137745
C  -4.839358 -0.110757 -0.171923
H  1.764739 0.482908 1.50105
H  0.218246 0.654153 -1.140135
H  -0.407588 -0.398936 1.679054
H  1.739761 -1.956514 1.595169
H  1.990854 -2.938404 0.129778
H  3.841605 -0.769169 1.486332
H  2.758846 2.519637 0.634101
H  2.632987 1.966265 -1.052492
H  -0.106904 -2.056187 -0.895736
H  -0.439368 -2.677855 0.729301
H  0.2749 2.888508 0.106811
H  -0.40189 2.052661 1.528758
H  2.942056 -1.832574 -1.963365
H  1.390485 -0.952985 -2.107757
H  2.942227 -0.068053 -2.147581
H  -1.668486 2.42227 -1.259214
H  -2.295728 3.030452 0.281287
H  5.674051 -1.382779 0.052658
H  6.283002 0.809902 0.056045
H  5.519946 2.483759 -0.21009
H  -2.483781 -2.460708 0.596321
H  -4.45685 1.98836 -0.498431
H  -4.924043 -2.264104 0.211788
H  -6.710868 -0.761843 -0.311601
