program: Orca
programVersion: 5.0.2
elementType: Cl Cl S S P O O C C C C C C C C C C C H H H H H H H H H H H H H H H
charge: 0
multiplicity: 1
keywords: wb97x-d3
keywords: def2-TZVPP
keywords: def2/J RIJCOSX
keywords: DEFGRID2
keywords: scfconv7
keywords: smallprint printgap noloewdin
keywords: NOSOSCF
formula: C11H15Cl2O2PS2
InChI: InChI=1/C11H15Cl2O2PS2/c1-3-7-18-16(17,14-4-2)15-11-6-5-9(12)8-10(11)13/h5-6,8H,3-4,7H2,1-2H3
33 atoms
Cl -1.498024 -1.862164 -1.684274
Cl -5.412859 1.05628 0.539701
S  3.018737 -0.504422 -0.806806
S  1.285246 0.109628 2.075227
P  1.528865 0.504566 0.21729
O  0.240279 0.236771 -0.742893
O  1.834563 2.0296 -0.171072
C  3.01926 -2.108786 0.065566
C  1.816632 -2.983311 -0.236924
C  1.952207 -4.353898 0.411335
C  -1.053721 0.461017 -0.391782
C  2.588295 2.89824 0.687036
C  -1.998868 -0.473329 -0.803982
C  -1.471481 1.579035 0.314582
C  4.066206 2.581198 0.704004
C  -3.342787 -0.291006 -0.524824
C  -2.811311 1.765269 0.606956
C  -3.739704 0.828768 0.185683
H  3.117066 -1.913479 1.134539
H  3.94457 -2.582705 -0.269654
H  0.911456 -2.497503 0.129383
H  1.699727 -3.082829 -1.317455
H  1.079975 -4.970988 0.198425
H  2.830673 -4.887517 0.044705
H  2.040288 -4.273572 1.495557
H  2.411451 3.896718 0.288933
H  2.174688 2.856334 1.697563
H  -0.75389 2.322747 0.629903
H  4.484543 2.565395 -0.301695
H  4.588521 3.349049 1.275324
H  4.269166 1.620717 1.175759
H  -4.066488 -1.022147 -0.855152
H  -3.127592 2.638835 1.158528
totalener: -2636.99248913 hartree
nucrepener: 2125.63467069 hartree
electener: -4762.62715981 hartree
oneelecener: -7862.87105279 hartree
twoeener: 3100.24389298 hartree
kineticenergy: 2631.05879686 hartree
xcener: -154.161934561558 hartree
chargesum: 0.0000000
charge: -0.056456 -0.069977 -0.122117 -0.361585 0.576219 -0.303005 -0.338248 -0.114881 -0.075079 -0.247056 0.204710 0.017208 0.026134 -0.113712 -0.244532 -0.109325 -0.132761 0.062443 0.115466 0.112435 0.042309 0.071429 0.089559 0.074964 0.082552 0.100636 0.092056 0.115544 0.092746 0.089326 0.087095 0.114980 0.120924
qa: -0.0565 -0.0700 -0.1221 -0.3616 0.5762 -0.3030 -0.3382 -0.1149 -0.0751 -0.2471 0.2047 0.0172 0.0261 -0.1137 -0.2445 -0.1093 -0.1328 0.0624 0.1155 0.1124 0.0423 0.0714 0.0896 0.0750 0.0826 0.1006 0.0921 0.1155 0.0927 0.0893 0.0871 0.1150 0.1209
va: 1.2559 1.2322 2.3246 2.0784 5.4127 2.1524 2.1029 3.8908 3.8639 3.9481 3.8877 3.8763 3.9635 3.9774 3.9207 4.0274 4.0396 3.9376 1.0298 1.0086 1.0401 1.0164 1.0068 1.0037 1.0035 0.9883 1.0114 1.0135 1.0039 1.0126 1.0158 1.0216 1.0124
dispcorr: -0.018153562 hartree
energy: -2637.010642688671
dipole: 32.21244 -31.29499 0.91745 -5.04055 5.39272 0.35217 7.04353 -7.00474 0.03879
magnitude: 0.98349 au
magnitude: 2.49982 debye
