program: Gaussian 09
title: 000066412
version: EM64L-G09RevD.01
frameworkgroup: C1[X(C5H9NO)]
method: RPBEPBE
basis: SDD
operation: Freq
keyword: #pfreq=noraman
keyword: PBEPBE/SDD
title: #p freq=noraman PBEPBE/SDD
converged: YES YES NO NO
title: Mulliken charges:
elementType: O N C C C C C H H H H H H H H H
charge: -0.282717 -0.107428 -0.308018 -0.484047 0.226646 -0.436002 -0.672970 0.226755 0.227011 0.234533 0.234209 0.221884 0.239652 0.219954 0.238088 0.222450
chargesum: 0.00000
title: Mulliken charges with hydrogens summed into heavy atoms:
elementType: O N C C C C C
charge: -0.282717 -0.107428 0.145748 -0.015306 0.226646 0.025534 0.007523
polarizability: 7.66931948e+01 -1.38157866e+00 5.94523999e+01 3.05633275e+00 -1.09422130e+00 4.77982996e+01
1716.lowfreq: -13.6099 -0.0005 0.0006 0.0008 12.7308 20.3728 55.2908 103.4536 154.3107
frequency: 55.2320 103.4110 154.3038 192.9536 300.6729 372.6614 586.1337 662.7459 714.6060 779.3836 814.1234 844.1926 901.3623 924.9777 938.6062 971.3915 1064.4678 1081.6786 1094.3946 1153.3300 1197.4517 1205.9214 1264.1216 1290.8011 1316.8778 1330.5504 1389.8548 1456.6481 1470.5703 1474.7841 1486.6680 1488.1666 1639.0179 2992.6425 3006.1506 3012.3193 3030.6458 3062.0175 3080.4966 3090.2322 3101.2690 3107.6254
redmass: 2.4297 2.3339 2.6508 1.1593 2.4614 2.9199 4.5266 3.4934 6.3223 1.3756 1.1932 5.8452 7.0363 3.0587 3.6591 2.4794 1.9964 1.7930 1.7067 1.1123 2.3697 1.1069 1.1964 1.2656 1.3530 1.7121 1.2009 1.0822 1.0946 1.0419 1.0887 1.0563 8.7246 1.0349 1.0642 1.0582 1.0585 1.1077 1.0974 1.1009 1.1109 1.1005
irintensity: 0.2004 1.1220 4.6072 0.6726 10.2719 9.4119 2.6822 3.5002 6.5680 2.7623 0.4919 21.6838 78.6338 23.4225 0.7672 29.6257 10.5183 3.7309 2.3505 1.2415 60.3536 0.9696 11.0999 2.1919 7.3585 5.9386 10.0752 11.6107 1.3306 14.2229 6.9067 10.2333 110.0422 32.2748 16.2618 38.1040 57.7812 6.4692 3.6187 35.3330 44.3370 36.0893
temp: 298.150 k
press: 1.00000 atm
elementType: 8 7 6 6 6 6 6 1 1 1 1 1 1 1 1 1
symmnumber: 1
zpe: 354127.3 jmol-1
zpe.correction: 0.134880 hartree
zpe.thermalcorrener: 0.142265 hartree
zpe.thermalcorrenthalpy: 0.143209 hartree
zpe.thermalcorrgfe: 0.102778 hartree
zpe.sumelectzpe: -325.326979 hartree
zpe.sumelectthermal: -325.319594 hartree
zpe.sumelectthermalent: -325.318649 hartree
zpe.sumelectthermalfe: -325.359081 hartree
dipole: 0.8330 1.1543 0.1303
dipole: 1.4295
quadrupole: -33.9621 -48.5570 -41.6424
quadrupole: 2.6686 0.9906 1.1457
quadrupole: 7.4251 -7.1698 -0.2552 2.6686 0.9906 1.1457
hfenergy: -325.4618586 hartree
pointgroup: C01 [X(C5H9N1O1)]
dipole: 0.3392886 0.3897404 0.22197 debye
dipolederiv: -0.7287641 -0.3144023 -0.1662771 -0.0469835 -0.8771813 -0.1772976 -0.1036546 -0.2320202 -0.3160404 -0.5692963 0.1772382 0.0388192 0.1408364 -0.6648123 -0.0713538 -0.008205 -0.0503223 -0.3607547 0.3862671 0.2079476 0.0586282 0.0209573 0.0919038 -0.0672662 0.0148904 -0.0261521 0.3389808 0.201675 -0.067624 -0.0310004 -0.0418238 0.1123505 -0.0538281 -0.0342347 -0.0554419 0.2553583 0.7918847 0.0076083 0.1078076 -0.0028011 1.1076873 0.2852235 0.1774559 0.2806183 0.1048414 -0.0965274 0.0024992 -0.0008882 0.066928 0.0855312 -0.0391754 0.0391193 -0.0475406 0.0918458 0.0204064 0.012589 0.021904 -0.017357 0.0664295 -0.0282182 -0.0521588 -0.0192934 0.0152745 0.0255209 -0.0373704 -0.0342761 -0.0159368 0.0655278 -0.0407065 -0.0851376 -0.0824167 -0.1325698 -0.0309911 -0.1023365 0.0298658 -0.0911622 -0.0212424 0.0665888 0.0812176 0.1004678 0.0082492 -0.0727644 0.053474 0.0891733 -0.0179326 0.0802882 -0.0276506 0.1396816 -0.031911 -0.0279578 0.01147 0.0607739 -0.0412321 0.0292279 0.013395 0.0845642 -0.1278 0.1078253 -0.0445954 0.0264474 0.0193969 -0.0048327 0.0336037 0.0071613 0.1314769 -0.0213448 0.0956513 -0.0378162 0.0476463 -0.0103185 0.0037804 -0.0557271 -0.0645936 -0.0980445 0.0018588 -0.0667445 0.054767 -0.2149314 0.0127871 -0.0312874 0.011731 0.1063628 -0.005485 -0.0396336 -0.0078333 0.0646365 0.1067558 -0.0673923 -0.0143158 -0.0275229 -0.0874953 -0.0885293 0.0011793 -0.0645072 0.0460099 0.0952012 0.0451298 -0.0258687 0.0139628 -0.0213124 0.1297019 0.0167662 0.0996205 -0.0602291 unknown
polarizability: 76.5937103|-2.891295|58.5956344|2.1430127|3.3949091|48.7545497 unknown
InChI: InChI=1S/C5H9NO/c1-2-5-6-3-4-7-5/h2-4H2,1H3
charge 0 multiplicity 1
16 atoms
O  0.286833 1.072819 0.166814
N  0.585383 -1.176953 -0.376643
C  1.748211 0.827233 0.409921
C  1.942057 -0.683646 0.044542
C  -0.240651 -0.172034 -0.280342
C  -1.713033 -0.165625 -0.577531
C  -2.570165 0.18275 0.666372
H  1.950369 1.057676 1.468781
H  2.310631 1.5165 -0.241081
H  2.65424 -0.829587 -0.786359
H  2.292768 -1.283536 0.902682
H  -1.908447 0.576057 -1.375462
H  -1.975094 -1.162204 -0.96895
H  -3.642329 0.185044 0.401583
H  -2.303712 1.179004 1.057887
H  -2.415863 -0.558297 1.470585
