program: Orca
programVersion: 5.0.2
elementType: Cl Cl S S P O O C C C C C C C C C C C H H H H H H H H H H H H H H H
charge: 0
multiplicity: 1
keywords: wb97x-d3
keywords: def2-TZVPP
keywords: def2/J RIJCOSX
keywords: DEFGRID2
keywords: scfconv7
keywords: smallprint printgap noloewdin
keywords: NOSOSCF
formula: C11H15Cl2O2PS2
InChI: InChI=1/C11H15Cl2O2PS2/c1-3-7-18-16(17,14-4-2)15-11-6-5-9(12)8-10(11)13/h5-6,8H,3-4,7H2,1-2H3
33 atoms
Cl -0.999052 0.815195 -2.638303
Cl -5.395607 0.084989 0.354193
S  1.321312 -1.272497 -1.126324
S  1.554046 -0.409945 2.17223
P  1.530295 0.173803 0.340894
O  0.334008 1.20992 -0.07354
O  2.780478 1.04125 -0.133437
C  2.035362 -2.728052 -0.28975
C  3.549182 -2.703407 -0.189047
C  4.08263 -4.000958 0.401513
C  -0.989733 0.906061 0.053277
C  3.483178 1.921259 0.755607
C  -1.748771 0.713588 -1.096486
C  -1.60258 0.843113 1.295057
C  2.687088 3.155535 1.114004
C  -3.108186 0.461452 -1.008211
C  -2.959379 0.587961 1.394227
C  -3.70233 0.396466 0.240963
H  1.696641 -3.567213 -0.901504
H  1.565835 -2.824315 0.690216
H  3.977005 -2.5318 -1.178759
H  3.855842 -1.862081 0.435876
H  5.1696 -3.979636 0.473676
H  3.689701 -4.171415 1.404577
H  3.811345 -4.861548 -0.212261
H  3.771893 1.372099 1.654944
H  4.390533 2.187238 0.215166
H  -1.012296 0.998356 2.187017
H  3.320343 3.838586 1.680843
H  2.337027 3.678529 0.225134
H  1.825798 2.914625 1.736484
H  -3.691311 0.315985 -1.906186
H  -3.433242 0.540174 2.364191
totalener: -2636.99324164 hartree
nucrepener: 2129.36453848 hartree
electener: -4766.35778013 hartree
oneelecener: -7870.47060647 hartree
twoeener: 3104.11282634 hartree
kineticenergy: 2631.05836877 hartree
xcener: -154.161029341896 hartree
chargesum: -0.0000000
charge: -0.048452 -0.068864 -0.133678 -0.387779 0.601180 -0.341708 -0.307591 -0.109426 -0.087691 -0.250766 0.234858 0.019636 -0.021368 -0.140770 -0.227610 -0.088358 -0.118246 0.048431 0.113267 0.117741 0.069320 0.063650 0.087752 0.083560 0.074859 0.090026 0.099292 0.131129 0.085547 0.093430 0.078418 0.116285 0.123928
qa: -0.0485 -0.0689 -0.1337 -0.3878 0.6012 -0.3417 -0.3076 -0.1094 -0.0877 -0.2508 0.2349 0.0196 -0.0214 -0.1408 -0.2276 -0.0884 -0.1182 0.0484 0.1133 0.1177 0.0693 0.0636 0.0878 0.0836 0.0749 0.0900 0.0993 0.1311 0.0855 0.0934 0.0784 0.1163 0.1239
va: 1.2635 1.2333 2.3548 2.0506 5.3957 2.1196 2.1236 3.8982 3.8683 3.9482 3.8307 3.8862 4.0340 4.0336 3.9011 3.9999 4.0248 3.9443 1.0076 1.0324 1.0172 1.0279 1.0062 1.0036 1.0034 1.0136 0.9901 1.0177 1.0114 1.0075 1.0190 1.0201 1.0106
dispcorr: -0.017156059 hartree
energy: -2637.010397700320
dipole: 36.06603 -35.24432 0.82171 -8.92390 8.90473 -0.01917 11.02391 -10.87790 0.14601
magnitude: 0.83480 au
magnitude: 2.12190 debye
