program: Orca
programVersion: 5.0.2
elementType: Cl Cl S S P O O C C C C C C C C C C C H H H H H H H H H H H H H H H
charge: 0
multiplicity: 1
keywords: wb97x-d3
keywords: def2-TZVPP
keywords: def2/J RIJCOSX
keywords: DEFGRID2
keywords: scfconv7
keywords: smallprint printgap noloewdin
keywords: NOSOSCF
formula: C11H15Cl2O2PS2
InChI: InChI=1/C11H15Cl2O2PS2/c1-3-7-18-16(17,14-4-2)15-11-6-5-9(12)8-10(11)13/h5-6,8H,3-4,7H2,1-2H3
33 atoms
Cl -0.845301 2.359702 -1.800584
Cl -5.393772 -0.287284 -0.733717
S  1.283291 -1.556782 -0.585621
S  1.393641 -0.725307 2.723399
P  1.413167 -0.111118 0.914501
O  0.221125 0.893013 0.430685
O  2.667819 0.816358 0.602422
C  2.169019 -2.939098 0.218001
C  3.667558 -2.736536 0.36032
C  4.395505 -2.529194 -0.957113
C  -1.077774 0.564841 0.196948
C  2.869962 1.463102 -0.663464
C  -1.717685 1.220082 -0.850874
C  -1.788191 -0.349328 0.960307
C  4.325856 1.845004 -0.764456
C  -3.048147 0.966172 -1.137306
C  -3.116023 -0.616736 0.674162
C  -3.738845 0.041039 -0.372962
H  1.947641 -3.793192 -0.425313
H  1.696685 -3.116828 1.184065
H  3.859769 -1.904098 1.040296
H  4.061381 -3.625176 0.861937
H  4.049414 -1.630284 -1.46805
H  5.468114 -2.426238 -0.795755
H  4.242349 -3.371139 -1.6342
H  2.591539 0.789164 -1.478859
H  2.225193 2.34152 -0.719659
H  -1.306637 -0.850185 1.789469
H  4.49993 2.370274 -1.703411
H  4.619953 2.505888 0.050036
H  4.969287 0.96594 -0.744708
H  -3.533391 1.483176 -1.952705
H  -3.661962 -1.333301 1.270956
totalener: -2636.99262990 hartree
nucrepener: 2126.25106718 hartree
electener: -4763.24369708 hartree
oneelecener: -7863.74921531 hartree
twoeener: 3100.50551823 hartree
kineticenergy: 2631.04590924 hartree
xcener: -154.161015122679 hartree
chargesum: 0.0000000
charge: -0.060341 -0.068364 -0.162419 -0.351859 0.605368 -0.323940 -0.298249 -0.122367 -0.100166 -0.245145 0.187184 -0.014093 0.015539 -0.121965 -0.219244 -0.098584 -0.125859 0.052008 0.116167 0.128333 0.070857 0.075946 0.065590 0.092805 0.081839 0.097713 0.105095 0.128267 0.078854 0.092854 0.078522 0.115601 0.124053
qa: -0.0603 -0.0684 -0.1624 -0.3519 0.6054 -0.3239 -0.2982 -0.1224 -0.1002 -0.2451 0.1872 -0.0141 0.0155 -0.1220 -0.2192 -0.0986 -0.1259 0.0520 0.1162 0.1283 0.0709 0.0759 0.0656 0.0928 0.0818 0.0977 0.1051 0.1283 0.0789 0.0929 0.0785 0.1156 0.1241
va: 1.2528 1.2338 2.2820 2.1022 5.4119 2.1465 2.1383 3.8892 3.8626 3.9371 3.8606 3.8884 3.9760 3.9621 3.9622 4.0081 4.0501 3.9444 1.0046 1.0347 1.0306 1.0104 1.0109 1.0050 1.0068 0.9952 1.0021 1.0410 1.0073 1.0057 1.0072 1.0203 1.0110
dispcorr: -0.018357834 hartree
energy: -2637.010987730122
dipole: 39.80997 -39.03969 0.77027 -12.73037 12.27010 -0.46026 -1.61443 0.74668 -0.86776
magnitude: 1.24826 au
magnitude: 3.17283 debye
