program: Orca
programVersion: 5.0.2
elementType: S P O O O O N C C C C C C C C C C H H H H H H H H H H H H H H H H H H H H
charge: 0
multiplicity: 1
keywords: wb97x-d3
keywords: def2-TZVPP
keywords: def2/J RIJCOSX
keywords: DEFGRID2
keywords: scfconv7
keywords: smallprint printgap noloewdin
keywords: NOSOSCF
formula: C10H20NO4PS
InChI: InChI=1/C10H20NO4PS/c1-6-11-16(17,13-5)15-9(4)7-10(12)14-8(2)3/h7-8,11H,6H2,1-5H3
37 atoms
S  -1.434607 1.083288 1.589525
P  -2.089712 0.024426 0.119542
O  -1.057349 -0.178616 -1.134079
O  3.242251 0.240189 0.430336
O  -2.370114 -1.524802 0.425361
O  3.014673 -1.658519 -0.733179
N  -3.461096 0.595292 -0.580003
C  4.635199 -0.019323 0.721118
C  -3.739959 2.022149 -0.720375
C  0.170498 -0.802143 -1.052752
C  4.946205 0.741077 1.991886
C  5.500199 0.4220 -0.44295
C  -2.910414 2.715646 -1.783655
C  1.170215 -0.144308 -0.45331
C  2.545845 -0.62879 -0.295919
C  0.169595 -2.123091 -1.727217
C  -3.151331 -1.909771 1.560186
H  4.767116 -1.088737 0.898488
H  -3.587438 2.493853 0.249535
H  -4.801238 2.11563 -0.947827
H  -3.813139 0.033153 -1.347548
H  5.983906 0.566133 2.274493
H  4.318164 0.411798 2.819989
H  4.812762 1.815807 1.859742
H  5.380669 1.488603 -0.639118
H  5.273647 -0.12609 -1.357057
H  6.548404 0.241798 -0.203623
H  -1.848559 2.701598 -1.533789
H  -3.037731 2.241547 -2.75758
H  -3.21417 3.758714 -1.877709
H  0.961667 0.83136 -0.035216
H  1.149007 -2.584126 -1.746051
H  -0.182622 -2.009646 -2.754399
H  -0.525359 -2.798873 -1.225482
H  -3.037081 -2.984912 1.670862
H  -2.799925 -1.418533 2.468141
H  -4.204271 -1.674381 1.407113
elementType: S P O N C H
totalener: -1488.52047932 hartree
nucrepener: 1598.61039312 hartree
electener: -3087.13087244 hartree
oneelecener: -5223.29245279 hartree
twoeener: 2136.16158034 hartree
cpcmener: -0.02927334 hartree
kineticenergy: 1483.74114349 hartree
xcener: -107.350922132644 hartree
chargesum: 0.0000000
charge: -0.470436 0.716269 -0.364265 -0.296137 -0.354688 -0.510494 -0.273344 0.160809 -0.016256 0.271686 -0.253069 -0.263099 -0.239543 -0.289410 0.522552 -0.244461 -0.111137 0.064189 0.086086 0.094937 0.164727 0.091138 0.097097 0.089146 0.090832 0.093604 0.097459 0.072646 0.085468 0.091624 0.125611 0.106122 0.109947 0.107407 0.125965 0.101886 0.119132
qa: -0.4704 0.7163 -0.3643 -0.2961 -0.3547 -0.5105 -0.2733 0.1608 -0.0163 0.2717 -0.2531 -0.2631 -0.2395 -0.2894 0.5226 -0.2445 -0.1111 0.0642 0.0861 0.0949 0.1647 0.0911 0.0971 0.0891 0.0908 0.0936 0.0975 0.0726 0.0855 0.0916 0.1256 0.1061 0.1099 0.1074 0.1260 0.1019 0.1191
va: 1.9705 5.4389 2.0914 2.1327 2.0968 1.9858 3.1252 3.8102 3.8880 3.6707 3.9312 3.9100 3.8965 3.9313 4.1067 3.9551 3.8547 1.0230 1.0210 0.9979 1.0208 1.0054 1.0083 1.0069 1.0064 1.0163 1.0056 1.0135 1.0062 1.0102 1.0411 1.0326 1.0014 1.0089 0.9895 1.0040 0.9929
dispcorr: -0.016095046 hartree
energy: -1488.536574366728
dipole: 9.16359 -10.81209 -1.64849 3.59332 -3.73027 -0.13695 -2.84606 2.12702 -0.71905
magnitude: 1.80369 au
magnitude: 4.58463 debye
