program: Orca
programVersion: 5.0.2
elementType: S P O O O O N C C C C C C C C C C H H H H H H H H H H H H H H H H H H H H
charge: 0
multiplicity: 1
keywords: wb97x-d3
keywords: def2-TZVPP
keywords: def2/J RIJCOSX
keywords: DEFGRID2
keywords: scfconv7
keywords: smallprint printgap noloewdin
keywords: NOSOSCF
formula: C10H20NO4PS
InChI: InChI=1/C10H20NO4PS/c1-6-11-16(17,13-5)15-9(4)7-10(12)14-8(2)3/h7-8,11H,6H2,1-5H3
37 atoms
S  -1.35205 1.722159 0.823724
P  -2.071071 0.125609 0.023725
O  -1.041199 -1.137205 -0.113007
O  3.321331 -0.06276 0.7833
O  -3.219198 -0.624678 0.858269
O  3.107928 -0.76455 -1.331977
N  -2.667609 0.318703 -1.494508
C  4.738533 0.186431 0.62957
C  -3.366538 1.534634 -1.908223
C  0.217433 -1.059163 -0.667933
C  5.517894 -1.100476 0.809119
C  5.098073 1.228665 1.666143
C  -4.733842 1.717498 -1.278507
C  1.209866 -0.654928 0.13386
C  2.618801 -0.519736 -0.248828
C  0.247498 -1.499394 -2.083865
C  -3.036326 -0.945822 2.240908
H  4.918404 0.594529 -0.367288
H  -3.45234 1.490794 -2.993371
H  -2.726597 2.386913 -1.682215
H  -3.015958 -0.528775 -1.931145
H  6.583595 -0.894769 0.705135
H  5.255015 -1.851041 0.064284
H  5.354816 -1.524341 1.801145
H  4.529875 2.148134 1.523381
H  6.155496 1.477399 1.577787
H  4.924767 0.865261 2.68021
H  -5.220132 2.603516 -1.688372
H  -5.379239 0.860426 -1.474322
H  -4.662442 1.85136 -0.198023
H  0.96432 -0.390192 1.153778
H  -0.272976 -2.453515 -2.182764
H  1.254148 -1.610231 -2.467352
H  -0.284228 -0.779775 -2.709687
H  -2.679002 -0.082573 2.803662
H  -4.007101 -1.244386 2.628094
H  -2.33424 -1.771022 2.361954
elementType: S P O N C H
totalener: -1488.52010116 hartree
nucrepener: 1592.86619241 hartree
electener: -3081.38629357 hartree
oneelecener: -5211.65969262 hartree
twoeener: 2130.27339904 hartree
cpcmener: -0.02984050 hartree
kineticenergy: 1483.73358094 hartree
xcener: -107.349351883203 hartree
chargesum: 0.0000000
charge: -0.473740 0.734115 -0.365670 -0.296537 -0.357868 -0.511618 -0.279751 0.157796 -0.027840 0.268693 -0.261043 -0.252352 -0.241919 -0.296227 0.526596 -0.241213 -0.105544 0.065207 0.095558 0.088560 0.167725 0.097643 0.092678 0.090363 0.096751 0.091120 0.089515 0.091925 0.085522 0.072946 0.120249 0.113112 0.108566 0.106263 0.099523 0.129146 0.121751
qa: -0.4737 0.7341 -0.3657 -0.2965 -0.3579 -0.5116 -0.2798 0.1578 -0.0278 0.2687 -0.2610 -0.2524 -0.2419 -0.2962 0.5266 -0.2412 -0.1055 0.0652 0.0956 0.0886 0.1677 0.0976 0.0927 0.0904 0.0968 0.0911 0.0895 0.0919 0.0855 0.0729 0.1202 0.1131 0.1086 0.1063 0.0995 0.1291 0.1218
va: 1.9652 5.4309 2.0978 2.1340 2.0712 1.9838 3.1429 3.8126 3.8926 3.6874 3.9083 3.9317 3.8994 3.9462 4.0929 3.9575 3.8367 1.0223 0.9978 1.0183 1.0185 1.0055 1.0172 1.0067 1.0084 1.0052 1.0068 1.0099 1.0057 1.0167 1.0411 1.0032 1.0319 1.0106 1.0074 0.9889 0.9907
dispcorr: -0.016288741 hartree
energy: -1488.536389899857
dipole: 7.57395 -8.73502 -1.16106 0.24545 -1.15152 -0.90607 -0.45007 0.22904 -0.22103
magnitude: 1.48926 au
magnitude: 3.78539 debye
