program: Orca
programVersion: 5.0.2
elementType: S P O O O O N C C C C C C C C C C H H H H H H H H H H H H H H H H H H H H
charge: 0
multiplicity: 1
keywords: wb97x-d3
keywords: def2-TZVPP
keywords: def2/J RIJCOSX
keywords: DEFGRID2
keywords: scfconv7
keywords: smallprint printgap noloewdin
keywords: NOSOSCF
formula: C10H20NO4PS
InChI: InChI=1/C10H20NO4PS/c1-6-11-16(17,13-5)15-9(4)7-10(12)14-8(2)3/h7-8,11H,6H2,1-5H3
37 atoms
S  -2.641624 0.71512 1.852535
P  -2.349858 -0.194848 0.179795
O  -0.793267 -0.595787 -0.143246
O  3.719053 -0.877775 -0.055633
O  -2.961382 -1.672852 0.086067
O  3.117056 1.26226 -0.326306
N  -2.85139 0.573191 -1.170672
C  5.1260 -0.551731 -0.065989
C  -3.964295 1.509867 -1.25025
C  0.314107 0.198354 -0.198243
C  5.847648 -1.809439 -0.501536
C  5.560115 -0.087918 1.310979
C  -3.693663 2.571232 -2.296809
C  1.47279 -0.473905 -0.093117
C  2.816159 0.095625 -0.172938
C  0.111322 1.654591 -0.405144
C  -2.783754 -2.630481 1.133649
H  5.304242 0.238334 -0.798905
H  -4.090669 1.970337 -0.271091
H  -4.894934 0.984367 -1.478386
H  -2.557185 0.173228 -2.054323
H  5.527343 -2.134007 -1.491896
H  5.685757 -2.627777 0.201836
H  6.919048 -1.616397 -0.546779
H  6.625426 0.143051 1.298927
H  5.394766 -0.867697 2.056045
H  5.03317 0.811446 1.628881
H  -4.5418 3.251409 -2.36926
H  -2.807777 3.155326 -2.046649
H  -3.541587 2.126118 -3.281365
H  1.420839 -1.545694 0.053138
H  -0.507878 2.074132 0.389736
H  -0.405534 1.836053 -1.348349
H  1.053526 2.187027 -0.418663
H  -1.776785 -3.048039 1.113647
H  -2.972023 -2.186671 2.111684
H  -3.504331 -3.425657 0.959768
elementType: S P O N C H
totalener: -1488.51944188 hartree
nucrepener: 1565.94609080 hartree
electener: -3054.46553268 hartree
oneelecener: -5157.28304665 hartree
twoeener: 2102.81751397 hartree
cpcmener: -0.02936162 hartree
kineticenergy: 1483.74306399 hartree
xcener: -107.357290867339 hartree
chargesum: -0.0000000
charge: -0.471410 0.689557 -0.312737 -0.301768 -0.363279 -0.518994 -0.240659 0.161461 -0.007073 0.245040 -0.252675 -0.263003 -0.255183 -0.309371 0.520733 -0.254782 -0.111413 0.063591 0.083540 0.093675 0.162268 0.096535 0.088980 0.090457 0.096967 0.090095 0.092704 0.092288 0.082146 0.089159 0.126742 0.109388 0.119390 0.117085 0.122004 0.100078 0.128463
qa: -0.4714 0.6896 -0.3127 -0.3018 -0.3633 -0.5190 -0.2407 0.1615 -0.0071 0.2450 -0.2527 -0.2630 -0.2552 -0.3094 0.5207 -0.2548 -0.1114 0.0636 0.0835 0.0937 0.1623 0.0965 0.0890 0.0905 0.0970 0.0901 0.0927 0.0923 0.0821 0.0892 0.1267 0.1094 0.1194 0.1171 0.1220 0.1001 0.1285
va: 1.9581 5.4575 2.1544 2.1238 2.0950 1.9749 3.1177 3.8122 3.8603 3.7438 3.9311 3.9083 3.9378 3.8738 4.0978 3.8924 3.8455 1.0229 1.0198 0.9944 1.0202 1.0083 1.0069 1.0055 1.0060 1.0065 1.0170 1.0085 1.0041 1.0002 1.0332 1.0223 1.0034 1.0415 0.9900 1.0065 0.9885
dispcorr: -0.015794834 hartree
energy: -1488.535236715028
dipole: 13.30388 -13.76143 -0.45755 1.40721 -2.48013 -1.07291 -6.42908 4.88132 -1.54776
magnitude: 1.93805 au
magnitude: 4.92614 debye
