program: Orca
programVersion: 5.0.2
elementType: S P O O O O N C C C C C C C C C C H H H H H H H H H H H H H H H H H H H H
charge: 0
multiplicity: 1
keywords: wb97x-d3
keywords: def2-TZVPP
keywords: def2/J RIJCOSX
keywords: DEFGRID2
keywords: scfconv7
keywords: smallprint printgap noloewdin
keywords: NOSOSCF
formula: C10H20NO4PS
InChI: InChI=1/C10H20NO4PS/c1-6-11-16(17,13-5)15-9(4)7-10(12)14-8(2)3/h7-8,11H,6H2,1-5H3
37 atoms
S  -1.348103 1.728423 0.808499
P  -2.070309 0.126217 0.023137
O  -1.039164 -1.135986 -0.115803
O  3.32372 -0.06526 0.782036
O  -3.21202 -0.622155 0.868251
O  3.116196 -0.797384 -1.323574
N  -2.677801 0.311786 -1.491681
C  4.743161 0.175817 0.631541
C  -3.384857 1.52388 -1.903637
C  0.219944 -1.058138 -0.671373
C  5.514851 -1.1109 0.842156
C  5.100948 1.23723 1.649315
C  -4.75004 1.700491 -1.267968
C  1.213668 -0.664197 0.134018
C  2.624058 -0.536967 -0.245424
C  0.247464 -1.487634 -2.090412
C  -3.020935 -0.935823 2.251366
H  4.930789 0.562934 -0.372112
H  -3.475577 1.478405 -2.988388
H  -2.748046 2.379475 -1.681597
H  -3.028757 -0.537515 -1.9213
H  6.582141 -0.91342 0.738867
H  5.251226 -1.875601 0.111863
H  5.344499 -1.513082 1.841889
H  6.160227 1.47943 1.56242
H  4.920169 0.895357 2.669528
H  4.53822 2.156237 1.484373
H  -4.675047 1.83522 -0.187861
H  -5.242464 2.583751 -1.676204
H  -5.392193 0.840215 -1.460379
H  0.96702 -0.401654 1.154217
H  1.253437 -1.593076 -2.476969
H  -0.287903 -0.765146 -2.709473
H  -0.270304 -2.442715 -2.195179
H  -2.661065 -0.069352 2.807318
H  -3.989276 -1.23301 2.645216
H  -2.317683 -1.759808 2.372763
elementType: S P O N C H
totalener: -1488.52010310 hartree
nucrepener: 1592.47544805 hartree
electener: -3080.99555115 hartree
oneelecener: -5210.87796400 hartree
twoeener: 2129.88241284 hartree
cpcmener: -0.02981995 hartree
kineticenergy: 1483.73266144 hartree
xcener: -107.349085933265 hartree
chargesum: -0.0000000
charge: -0.473564 0.733446 -0.366009 -0.296636 -0.357630 -0.511608 -0.279344 0.157870 -0.027888 0.268922 -0.261177 -0.252364 -0.242056 -0.296344 0.526881 -0.240896 -0.105540 0.065289 0.095526 0.088563 0.167080 0.097683 0.092700 0.090562 0.091131 0.089541 0.096801 0.073020 0.091972 0.085538 0.120097 0.108599 0.106225 0.113098 0.099544 0.129210 0.121757
qa: -0.4736 0.7334 -0.3660 -0.2966 -0.3576 -0.5116 -0.2793 0.1579 -0.0279 0.2689 -0.2612 -0.2524 -0.2421 -0.2963 0.5269 -0.2409 -0.1055 0.0653 0.0955 0.0886 0.1671 0.0977 0.0927 0.0906 0.0911 0.0895 0.0968 0.0730 0.0920 0.0855 0.1201 0.1086 0.1062 0.1131 0.0995 0.1292 0.1218
va: 1.9656 5.4311 2.0973 2.1339 2.0712 1.9839 3.1431 3.8123 3.8929 3.6868 3.9090 3.9316 3.8998 3.9480 4.0934 3.9575 3.8366 1.0224 0.9978 1.0184 1.0190 1.0055 1.0170 1.0066 1.0051 1.0068 1.0084 1.0166 1.0099 1.0056 1.0411 1.0324 1.0106 1.0031 1.0074 0.9889 0.9907
dispcorr: -0.016288389 hartree
energy: -1488.536391487702
dipole: 7.51421 -8.68181 -1.16760 0.26628 -1.15866 -0.89238 -0.36257 0.15748 -0.20509
magnitude: 1.48381 au
magnitude: 3.77154 debye
