program: Orca
programVersion: 5.0.2
elementType: S P O O O O N C C C C C C C C C C H H H H H H H H H H H H H H H H H H H H
charge: 0
multiplicity: 1
keywords: wb97x-d3
keywords: def2-TZVPP
keywords: def2/J RIJCOSX
keywords: DEFGRID2
keywords: scfconv7
keywords: smallprint printgap noloewdin
keywords: NOSOSCF
formula: C10H20NO4PS
InChI: InChI=1/C10H20NO4PS/c1-6-11-16(17,13-5)15-9(4)7-10(12)14-8(2)3/h7-8,11H,6H2,1-5H3
37 atoms
S  -2.837044 -0.552671 1.728033
P  -2.264986 0.002877 -0.023544
O  -0.683583 -0.240221 -0.375434
O  3.814533 -0.74262 -0.468836
O  -2.87502 -0.837469 -1.246489
O  3.248793 0.647385 1.191074
N  -2.519594 1.580945 -0.394564
C  5.226541 -0.591958 -0.191665
C  -3.696467 2.311246 0.077071
C  0.440352 0.17222 0.278882
C  5.753253 0.670064 -0.845555
C  5.899778 -1.83822 -0.723438
C  -4.988488 1.926122 -0.616655
C  1.576638 -0.3535 -0.210314
C  2.928651 -0.073576 0.266834
C  0.27785 1.126177 1.403229
C  -2.845733 -2.268585 -1.25528
H  5.371878 -0.540274 0.889461
H  -3.4871 3.369811 -0.072782
H  -3.779654 2.159453 1.152701
H  -2.213863 1.857081 -1.322408
H  5.270446 1.568204 -0.461563
H  5.616278 0.638584 -1.927481
H  6.821382 0.762211 -0.646895
H  5.774304 -1.934918 -1.802898
H  5.513444 -2.738504 -0.245053
H  6.968301 -1.786954 -0.515303
H  -5.25841 0.888192 -0.416002
H  -5.806289 2.554495 -0.26187
H  -4.912244 2.055619 -1.696892
H  1.495698 -1.04227 -1.042167
H  -0.271835 0.657356 2.220975
H  -0.294381 1.998441 1.087366
H  1.235429 1.459546 1.781553
H  -3.237751 -2.677725 -0.323413
H  -3.477838 -2.591957 -2.078545
H  -1.832959 -2.639386 -1.415536
elementType: S P O N C H
totalener: -1488.51949639 hartree
nucrepener: 1568.47528318 hartree
electener: -3056.99477957 hartree
oneelecener: -5162.42123874 hartree
twoeener: 2105.42645917 hartree
cpcmener: -0.02860523 hartree
kineticenergy: 1483.74048861 hartree
xcener: -107.355005785916 hartree
chargesum: -0.0000000
charge: -0.467536 0.711971 -0.306526 -0.302519 -0.360500 -0.521398 -0.274316 0.159645 -0.014511 0.247644 -0.262461 -0.252837 -0.243858 -0.312870 0.520690 -0.262238 -0.112414 0.064090 0.095678 0.087357 0.165757 0.092534 0.090276 0.097139 0.089046 0.096897 0.090655 0.073110 0.091762 0.086281 0.127122 0.115869 0.120966 0.116180 0.101112 0.129053 0.123149
qa: -0.4675 0.7120 -0.3065 -0.3025 -0.3605 -0.5214 -0.2743 0.1596 -0.0145 0.2476 -0.2625 -0.2528 -0.2439 -0.3129 0.5207 -0.2622 -0.1124 0.0641 0.0957 0.0874 0.1658 0.0925 0.0903 0.0971 0.0890 0.0969 0.0907 0.0731 0.0918 0.0863 0.1271 0.1159 0.1210 0.1162 0.1011 0.1291 0.1231
va: 1.9618 5.4348 2.1762 2.1246 2.0854 1.9714 3.1096 3.8133 3.8779 3.7556 3.9070 3.9316 3.9155 3.8628 4.0993 3.8899 3.8441 1.0229 0.9982 1.0190 1.0210 1.0174 1.0067 1.0057 1.0068 1.0082 1.0053 1.0150 1.0097 1.0053 1.0329 1.0140 1.0108 1.0411 1.0052 0.9888 0.9897
dispcorr: -0.015900478 hartree
energy: -1488.535396870393
dipole: 11.29200 -11.61110 -0.31910 3.59713 -3.17644 0.42068 -7.07004 5.01645 -2.05359
magnitude: 2.12038 au
magnitude: 5.38959 debye
