program: Orca
programVersion: 5.0.2
elementType: S P O O O O N C C C C C C C C C C H H H H H H H H H H H H H H H H H H H H
charge: 0
multiplicity: 1
keywords: wb97x-d3
keywords: def2-TZVPP
keywords: def2/J RIJCOSX
keywords: DEFGRID2
keywords: scfconv7
keywords: smallprint printgap noloewdin
keywords: NOSOSCF
formula: C10H20NO4PS
InChI: InChI=1/C10H20NO4PS/c1-6-11-16(17,13-5)15-9(4)7-10(12)14-8(2)3/h7-8,11H,6H2,1-5H3
37 atoms
S  -1.813473 2.130161 0.0264
P  -2.014939 0.225913 0.237111
O  -1.068163 -0.669019 -0.752924
O  3.276021 -0.880703 0.710621
O  -1.546218 -0.39242 1.639864
O  3.162652 0.166827 -1.264468
N  -3.535045 -0.351807 0.006393
C  4.713047 -0.73255 0.784752
C  -4.415492 0.168614 -1.038525
C  0.232082 -0.328262 -1.063017
C  5.205763 -1.847082 1.68085
C  5.063554 0.640079 1.322344
C  -4.003607 -0.199276 -2.450767
C  1.182641 -0.640052 -0.174214
C  2.618127 -0.392163 -0.335934
C  0.336936 0.295187 -2.403483
C  -2.006982 0.178831 2.86839
H  5.134638 -0.861859 -0.214168
H  -4.467298 1.251339 -0.92831
H  -5.413188 -0.213228 -0.825391
H  -3.638453 -1.349244 0.167327
H  4.941667 -2.827245 1.283042
H  4.802022 -1.760159 2.690807
H  6.292419 -1.801444 1.750332
H  6.147029 0.734886 1.397465
H  4.645126 0.790114 2.318789
H  4.7086 1.440807 0.674151
H  -4.758593 0.141287 -3.16043
H  -3.057439 0.266624 -2.729764
H  -3.900114 -1.278968 -2.566331
H  0.888692 -1.13115 0.743985
H  -0.145519 -0.346413 -3.143295
H  1.359645 0.474262 -2.710177
H  -0.203156 1.245022 -2.403695
H  -1.768338 1.24153 2.922123
H  -3.081957 0.043055 2.986698
H  -1.490424 -0.34415 3.66908
elementType: S P O N C H
totalener: -1488.52154346 hartree
nucrepener: 1600.53801003 hartree
electener: -3089.05955349 hartree
oneelecener: -5227.02970204 hartree
twoeener: 2137.97014855 hartree
cpcmener: -0.02975796 hartree
kineticenergy: 1483.74648190 hartree
xcener: -107.351268461392 hartree
chargesum: -0.0000000
charge: -0.473750 0.712342 -0.359397 -0.297071 -0.356620 -0.509997 -0.274483 0.159066 -0.017606 0.244013 -0.253755 -0.261703 -0.238442 -0.277336 0.521474 -0.238448 -0.111257 0.064830 0.085464 0.096031 0.166929 0.097320 0.089371 0.090943 0.097485 0.090753 0.093575 0.093141 0.070339 0.085464 0.133897 0.113351 0.113317 0.099788 0.103305 0.120056 0.127609
qa: -0.4738 0.7123 -0.3594 -0.2971 -0.3566 -0.5100 -0.2745 0.1591 -0.0176 0.2440 -0.2538 -0.2617 -0.2384 -0.2773 0.5215 -0.2384 -0.1113 0.0648 0.0855 0.0960 0.1669 0.0973 0.0894 0.0909 0.0975 0.0908 0.0936 0.0931 0.0703 0.0855 0.1339 0.1134 0.1133 0.0998 0.1033 0.1201 0.1276
va: 1.9580 5.4373 2.0807 2.1338 2.0882 1.9855 3.1263 3.8116 3.8883 3.7122 3.9324 3.9082 3.8959 3.9391 4.1045 3.9365 3.8509 1.0226 1.0197 0.9978 1.0196 1.0082 1.0068 1.0053 1.0057 1.0067 1.0165 1.0107 1.0082 1.0065 1.0339 0.9998 1.0347 1.0157 1.0025 0.9934 0.9902
dispcorr: -0.016578765 hartree
energy: -1488.538122223752
dipole: 8.11029 -9.40375 -1.29347 -4.52361 2.74624 -1.77737 1.22511 -0.24544 0.97966
magnitude: 2.40662 au
magnitude: 6.11715 debye
