program: Gaussian 09
title: 000066487
version: EM64L-G09RevD.01
frameworkgroup: C1[X(C26H18N2O3)]
method: RPBEPBE
basis: SDD
operation: Freq
keyword: #p
keyword: freq=noraman
keyword: PBEPBE/SDD
title: #p freq=noraman PBEPBE/SDD
converged: YES YES NO NO
title: Mulliken charges:
elementType: O O O N N C C C C C C C C C C C C C C C C C C C C C C C C C C H H H H H H H H H H H H H H H H H H
charge: -0.425003 -0.323238 -0.353629 -0.510063 -0.502072 0.036401 0.193467 0.356925 0.309106 0.300968 -0.141487 -0.233187 -0.092719 0.417523 -0.609766 -0.399977 -0.383565 0.419711 -0.224876 -0.232490 0.464457 -0.428330 -0.373011 -0.440077 -0.333937 -0.197225 -0.217532 -0.195917 -0.225006 -0.254981 -0.257487 0.292271 0.377441 0.297076 0.291442 0.361765 0.237284 0.238397 0.401991 0.251727 0.259860 0.236869 0.232822 0.229464 0.226772 0.230305 0.227138 0.231516 0.232874
chargesum: 0.00000
title: Mulliken charges with hydrogens summed into heavy atoms:
elementType: O O O N N C C C C C C C C C C C C C C C C C C C C C C C C C C
charge: -0.023012 -0.323238 -0.353629 -0.132622 -0.140307 0.036401 0.193467 0.356925 0.309106 0.300968 -0.141487 -0.233187 -0.092719 0.417523 -0.317495 -0.102901 -0.092122 0.419711 0.012409 0.005907 0.464457 -0.176603 -0.113151 -0.203208 -0.101115 0.032239 0.009240 0.034389 0.002133 -0.023464 -0.024613
polarizability: 6.60151526e+02 1.31231349e+00 4.19248333e+02 -6.70039392e+00 -3.60995107e+00 1.37341299e+02
1716.lowfreq: -3.3599 -0.0007 -0.0005 0.0002 2.5390 5.4578 21.2699 27.4133 34.4392
frequency: 21.2206 27.3977 34.3997 37.7620 56.3400 68.1951 86.2243 103.0155 134.7937 151.6494 161.0608 168.6811 187.8319 217.6251 229.5847 236.2615 247.0731 279.0324 299.4646 327.0330 349.8079 397.1861 402.3961 406.4228 409.4415 416.1459 426.2548 439.0703 451.8706 473.6646 498.8892 503.6540 513.0695 514.5754 542.7606 572.9793 602.0883 611.7098 614.2407 637.1841 646.9109 671.7630 675.2359 692.1013 693.8288 707.1937 712.5033 720.9348 725.2658 744.6644 760.9226 766.2075 800.6740 802.5877 827.2622 834.4761 839.6014 843.1959 855.4417 878.3402 887.1544 900.8990 913.7079 928.2983 936.3264 964.3915 971.3410 973.2560 984.6607 986.8028 987.3564 991.1642 995.5705 1014.2658 1021.1434 1025.2780 1028.6585 1057.7680 1084.7960 1088.0304 1094.1834 1097.6029 1139.5882 1159.4415 1171.9828 1172.4966 1173.9226 1185.3764 1191.5238 1198.8828 1228.4268 1254.0581 1258.5141 1269.6185 1305.8613 1318.4129 1320.9808 1343.3751 1356.0019 1375.4039 1379.9830 1388.9121 1396.1068 1410.9474 1433.5886 1444.9118 1458.3220 1466.1874 1477.7457 1483.3591 1485.8521 1505.5762 1528.2820 1543.2261 1559.5569 1581.8924 1593.4054 1602.0898 1603.6008 1610.6126 1612.2294 1624.3069 1626.9443 2101.2017 2945.3261 3122.6463 3127.1109 3133.7068 3134.3287 3135.8117 3147.1363 3147.9295 3152.3730 3154.4764 3165.0883 3166.9396 3169.6068 3173.1310 3182.2719 3204.0176 3447.4835
redmass: 5.5408 4.7428 5.2347 4.8762 4.3176 5.8659 5.6608 5.1221 6.0976 5.7157 7.9400 7.0126 5.9199 6.0800 6.4261 5.6768 5.1390 5.5338 5.2192 5.2213 5.2496 7.1011 9.0450 3.0373 2.9830 6.9888 3.7010 9.3967 5.6694 7.7517 3.4630 3.3427 5.7044 4.5138 7.0593 7.2133 6.6521 6.1591 6.5102 5.2642 6.8635 5.5157 3.9962 1.9755 2.7731 3.1228 1.6304 2.8957 5.2477 3.6357 1.7832 1.8860 2.3413 2.5329 1.4344 1.8687 2.8754 2.1266 5.0081 1.6406 3.2994 1.4562 1.3476 1.6816 1.4068 1.5544 3.0416 1.5166 5.1850 3.5310 1.3579 1.4140 1.3853 1.3626 2.8388 2.1553 2.1271 3.1070 1.5701 2.1948 1.6591 1.0560 2.4818 2.7966 1.0535 1.2096 1.0578 1.1188 1.1551 2.3505 2.4560 2.4268 1.7811 2.2189 2.2898 1.6835 1.4978 3.5093 3.3424 4.6745 4.3352 6.7247 6.0852 6.2416 2.6554 2.4824 3.0339 3.1520 3.2325 3.0025 2.4571 5.6558 7.3816 2.4839 3.4318 5.4938 4.4389 3.7078 5.7704 6.1581 4.8618 3.1505 2.9181 1.0855 1.0859 1.0876 1.0850 1.0878 1.0872 1.0863 1.0936 1.0924 1.0905 1.0964 1.0946 1.0982 1.1015 1.0999 1.0960 1.0901 1.0750
irintensity: 0.1142 0.6115 0.7260 0.3635 0.4057 0.8473 0.8481 0.1643 0.3453 0.4654 1.3044 0.3129 0.9711 0.1228 0.1794 2.6703 1.8742 1.8954 1.0403 11.7463 11.9257 2.0733 1.6392 1.2848 0.4381 4.5920 1.9167 5.5298 7.7851 12.6959 11.1443 21.4163 21.4744 28.7387 15.4472 6.2186 1.0685 2.8285 1.0639 9.3741 1.8611 2.9138 6.6238 25.5445 23.4264 19.2918 46.7427 63.9974 12.6932 2.8141 39.8227 103.0807 19.4131 35.8975 0.2873 8.5620 2.8379 14.2299 5.4142 10.3107 24.9454 8.0995 24.8529 1.5200 69.5973 2.8456 9.6518 2.7163 0.3984 1.0781 0.4415 0.8980 4.2239 0.6220 36.3663 4.7813 1.6154 31.3027 8.2268 9.1480 5.4319 131.5979 30.8028 55.5053 0.3301 24.7149 1.4622 1.5971 8.4338 16.8129 20.7793 40.4015 4.6391 30.6857 101.6948 26.0388 29.5120 190.7917 189.8974 129.6580 173.3769 114.8951 44.0318 147.0003 18.0424 13.3807 9.7531 0.3315 115.8187 26.7855 69.5103 528.0332 605.9160 291.0325 6.1254 43.7622 12.2706 47.7006 136.4559 20.1059 276.4411 105.5397 106.7943 164.9835 59.4408 8.4381 7.9228 2.4931 1.0453 4.7300 24.1878 12.9234 14.7213 28.1210 1.4391 44.2188 27.2997 37.9020 3.5171 2.4350 77.5599
temp: 298.150 k
press: 1.00000 atm
elementType: 8 8 8 7 7 6 6 6 6 6 6 6 6 6 6 6 6 6 6 6 6 6 6 6 6 6 6 6 6 6 6 1 1 1 1 1 1 1 1 1 1 1 1 1 1 1 1 1 1
symmnumber: 1
zpe: 975207.2 jmol-1
zpe.correction: 0.371437 hartree
zpe.thermalcorrener: 0.395191 hartree
zpe.thermalcorrenthalpy: 0.396135 hartree
zpe.thermalcorrgfe: 0.316790 hartree
zpe.sumelectzpe: -1334.714234 hartree
zpe.sumelectthermal: -1334.690480 hartree
zpe.sumelectthermalent: -1334.689536 hartree
zpe.sumelectthermalfe: -1334.768881 hartree
dipole: -2.3618 0.2069 -0.1257
dipole: 2.3741
quadrupole: -143.5560 -172.6711 -183.0979
quadrupole: 0.4763 -1.9209 1.2597
quadrupole: 22.8857 -6.2295 -16.6562 0.4763 -1.9209 1.2597
hfenergy: -1335.0856708 hartree
pointgroup: C01 [X(C26H18N2O3)]
dipole: 0.9311772 0.0662381 0.0312399 debye
polarizability: 659.6213645|-5.6100567|419.4074125|-16.0804483|-1.3046325|137.7123819 unknown
InChI: InChI=1S/C26H18N2O3/c29-24-18-13-7-8-14-19(18)25(30)23-22(24)20(27-16-9-3-1-4-10-16)15-21(26(23)31)28-17-11-5-2-6-12-17/h1-15,27-28,31H
charge 0 multiplicity 1
49 atoms
O  -0.580735 -3.354917 -0.040378
O  -2.483707 2.460184 0.195339
O  -2.999538 -3.066213 -0.056129
N  0.091911 2.201237 0.123471
N  1.889622 -2.428788 0.079764
C  -1.4061 0.297849 0.050289
C  -1.57251 -1.132963 0.009345
C  -0.061257 0.825847 0.070329
C  -3.920301 0.525215 0.054229
C  -4.078505 -0.895495 -0.004055
C  -2.572822 1.160061 0.100195
C  -0.44897 -1.994165 -0.01177
C  -2.89076 -1.755147 -0.017866
C  0.899648 -1.456614 0.037963
C  1.063471 -0.062667 0.091858
C  -5.074915 1.347429 0.075013
C  -5.378097 -1.467405 -0.041751
C  1.267836 2.979177 -0.036944
C  -6.359663 0.772908 0.034593
C  -6.513471 -0.638513 -0.023914
C  3.300892 -2.331577 0.033905
C  1.361482 4.194091 0.696537
C  2.301979 2.645708 -0.95594
C  4.044477 -3.43421 0.5439
C  4.001977 -1.234519 -0.538036
C  2.473465 5.044361 0.530151
C  3.41555 3.498824 -1.107594
C  5.451438 -3.433379 0.494994
C  5.412854 -1.242219 -0.57343
C  3.513639 4.69823 -0.364545
C  6.148723 -2.332226 -0.056866
H  2.055897 0.364216 0.230683
H  -0.837821 2.690331 0.233633
H  -4.929864 2.43082 0.122706
H  -5.463834 -2.557453 -0.083677
H  1.499573 -3.377268 0.156938
H  -7.245897 1.416654 0.048473
H  -7.515665 -1.078804 -0.053999
H  -1.661582 -3.528185 -0.054801
H  0.5620 4.455584 1.398631
H  2.205988 1.755818 -1.586154
H  3.511087 -4.284288 0.986656
H  3.462582 -0.401264 -0.993501
H  2.530917 5.975438 1.104629
H  4.199617 3.235029 -1.826477
H  6.004585 -4.290333 0.89452
H  5.937986 -0.390454 -1.019842
H  4.379146 5.357224 -0.489411
H  7.24297 -2.327969 -0.088265
