program: Orca
programVersion: 5.0.2
elementType: S P O O O O N C C C C C C C C C C H H H H H H H H H H H H H H H H H H H H
charge: 0
multiplicity: 1
keywords: wb97x-d3
keywords: def2-TZVPP
keywords: def2/J RIJCOSX
keywords: DEFGRID2
keywords: scfconv7
keywords: smallprint printgap noloewdin
keywords: NOSOSCF
formula: C10H20NO4PS
InChI: InChI=1/C10H20NO4PS/c1-6-11-16(17,13-5)15-9(4)7-10(12)14-8(2)3/h7-8,11H,6H2,1-5H3
37 atoms
S  -1.534525 -0.527996 2.38022
P  -2.062054 -0.284758 0.547353
O  -1.250713 -1.19944 -0.551843
O  2.961336 0.52513 0.325872
O  -3.467778 -0.9047 0.09689
O  3.045645 -1.120515 -1.188753
N  -2.054869 1.275304 0.054223
C  4.392517 0.717578 0.293126
C  -2.35386 1.724702 -1.302386
C  0.077995 -1.235891 -0.825084
C  4.769036 1.303814 1.636662
C  4.769341 1.626452 -0.860273
C  -1.11495 2.120587 -2.082552
C  0.959729 -0.428327 -0.21109
C  2.404412 -0.411881 -0.439844
C  0.334212 -2.267381 -1.864502
C  -4.653827 -0.554176 0.813631
H  4.87919 -0.252869 0.17441
H  -3.041104 2.569399 -1.237707
H  -2.893085 0.93422 -1.823487
H  -1.516516 1.916363 0.621298
H  4.493513 0.638199 2.455052
H  4.291805 2.271364 1.800193
H  5.847559 1.452561 1.679165
H  5.848655 1.780208 -0.863302
H  4.29248 2.602957 -0.762707
H  4.495927 1.201899 -1.825984
H  -0.559852 2.904307 -1.564881
H  -0.446093 1.273475 -2.232085
H  -1.396003 2.505958 -3.062847
H  0.615988 0.277216 0.532791
H  1.370417 -2.303811 -2.173058
H  -0.286157 -2.068622 -2.739971
H  0.049135 -3.250456 -1.484191
H  -4.518413 -0.676466 1.888946
H  -4.95318 0.472066 0.60116
H  -5.434012 -1.231171 0.476733
elementType: S P O N C H
totalener: -1488.52320997 hartree
nucrepener: 1615.97161356 hartree
electener: -3104.49482354 hartree
oneelecener: -5257.33680719 hartree
twoeener: 2152.84198366 hartree
cpcmener: -0.03199141 hartree
kineticenergy: 1483.75068062 hartree
xcener: -107.357579230220 hartree
chargesum: -0.0000000
charge: -0.454077 0.615215 -0.302896 -0.299145 -0.350138 -0.517480 -0.232420 0.156474 -0.006616 0.293363 -0.253928 -0.261964 -0.264239 -0.294052 0.507455 -0.249139 -0.113882 0.063926 0.094725 0.094439 0.171205 0.097107 0.088916 0.090879 0.097163 0.089911 0.093366 0.090444 0.084409 0.097949 0.090100 0.105865 0.110426 0.113951 0.103588 0.119701 0.129402
qa: -0.4541 0.6152 -0.3029 -0.2991 -0.3501 -0.5175 -0.2324 0.1565 -0.0066 0.2934 -0.2539 -0.2620 -0.2642 -0.2941 0.5075 -0.2491 -0.1139 0.0639 0.0947 0.0944 0.1712 0.0971 0.0889 0.0909 0.0972 0.0899 0.0934 0.0904 0.0844 0.0979 0.0901 0.1059 0.1104 0.1140 0.1036 0.1197 0.1294
va: 1.9975 5.4972 2.1766 2.1254 2.0759 1.9806 3.0652 3.8152 3.8591 3.6644 3.9326 3.9070 3.9442 3.7728 4.1662 3.9426 3.8495 1.0237 0.9975 1.0085 1.0178 1.0082 1.0069 1.0053 1.0059 1.0068 1.0166 1.0017 0.9988 1.0097 1.0732 1.0344 1.0018 1.0005 1.0048 0.9888 0.9904
dispcorr: -0.017225920 hartree
energy: -1488.540435894384
dipole: 12.02053 -13.17475 -1.15422 12.88036 -10.80508 2.07527 -9.85632 8.79863 -1.05770
magnitude: 2.59956 au
magnitude: 6.60755 debye
