program: Orca
programVersion: 5.0.2
elementType: S P O O O O N C C C C C C C C C C H H H H H H H H H H H H H H H H H H H H
charge: 0
multiplicity: 1
keywords: wb97x-d3
keywords: def2-TZVPP
keywords: def2/J RIJCOSX
keywords: DEFGRID2
keywords: scfconv7
keywords: smallprint printgap noloewdin
keywords: NOSOSCF
formula: C10H20NO4PS
InChI: InChI=1/C10H20NO4PS/c1-6-11-16(17,13-5)15-9(4)7-10(12)14-8(2)3/h7-8,11H,6H2,1-5H3
37 atoms
S  -3.703458 -0.353941 1.416169
P  -2.159721 -0.349535 0.269752
O  -0.958313 -1.181408 1.005525
O  3.187006 0.596321 0.117544
O  -2.229923 -1.190662 -1.095556
O  3.023905 -1.484378 -0.688696
N  -1.656822 1.132716 -0.22554
C  4.554025 0.732915 -0.335711
C  -1.630986 2.314853 0.628958
C  0.272978 -1.434218 0.436793
C  5.179586 1.800206 0.535056
C  4.583179 1.09818 -1.806729
C  -1.965569 3.563113 -0.161049
C  1.16522 -0.436094 0.408867
C  2.530385 -0.534363 -0.118396
C  0.412789 -2.848167 0.008747
C  -3.24327 -0.888925 -2.060796
H  5.074663 -0.213809 -0.176303
H  -0.652843 2.418039 1.106101
H  -2.359356 2.172139 1.42661
H  -0.959283 1.137628 -0.96254
H  5.144723 1.528434 1.590272
H  4.684307 2.76392 0.406792
H  6.226695 1.923692 0.259949
H  4.060996 2.038813 -1.988303
H  4.137276 0.327719 -2.434775
H  5.617614 1.223649 -2.127353
H  -2.964655 3.499306 -0.59228
H  -1.931744 4.438135 0.488063
H  -1.253495 3.723938 -0.971804
H  0.88642 0.52204 0.830065
H  1.42748 -3.105445 -0.267565
H  -0.239489 -3.049923 -0.843022
H  0.091552 -3.50536 0.818531
H  -3.051832 0.066759 -2.547741
H  -3.2159 -1.681118 -2.804318
H  -4.231405 -0.867755 -1.59918
elementType: S P O N C H
totalener: -1488.52030162 hartree
nucrepener: 1597.49414173 hartree
electener: -3086.01444335 hartree
oneelecener: -5219.80318188 hartree
twoeener: 2133.78873853 hartree
cpcmener: -0.03301766 hartree
kineticenergy: 1483.73384771 hartree
xcener: -107.348941032874 hartree
chargesum: -0.0000000
charge: -0.461553 0.651389 -0.352868 -0.296022 -0.341820 -0.509704 -0.248349 0.159805 -0.004183 0.254699 -0.253987 -0.263607 -0.247397 -0.293727 0.515405 -0.241796 -0.108225 0.064891 0.086883 0.081044 0.177148 0.097454 0.089438 0.091344 0.090690 0.094406 0.097968 0.079354 0.088119 0.087384 0.145909 0.105837 0.108906 0.109818 0.117835 0.125847 0.101665
qa: -0.4616 0.6514 -0.3529 -0.2960 -0.3418 -0.5097 -0.2483 0.1598 -0.0042 0.2547 -0.2540 -0.2636 -0.2474 -0.2937 0.5154 -0.2418 -0.1082 0.0649 0.0869 0.0810 0.1771 0.0975 0.0894 0.0913 0.0907 0.0944 0.0980 0.0794 0.0881 0.0874 0.1459 0.1058 0.1089 0.1098 0.1178 0.1258 0.1017
va: 1.9974 5.4704 2.0900 2.1351 2.0669 1.9862 3.0864 3.8102 3.8653 3.7099 3.9327 3.9051 3.9322 3.9373 4.1011 3.9462 3.8567 1.0222 0.9992 1.0215 1.0066 1.0081 1.0066 1.0054 1.0066 1.0170 1.0056 1.0089 1.0078 1.0023 1.0138 1.0299 1.0089 1.0027 0.9933 0.9904 1.0026
dispcorr: -0.016414658 hartree
energy: -1488.536716281771
dipole: 17.63510 -16.33104 1.30406 14.85313 -13.02707 1.82606 -10.03639 8.36540 -1.67099
magnitude: 2.79773 au
magnitude: 7.11126 debye
