program: Orca
programVersion: 5.0.2
elementType: S P O O O O N C C C C C C C C C C H H H H H H H H H H H H H H H H H H H H
charge: 0
multiplicity: 1
keywords: wb97x-d3
keywords: def2-TZVPP
keywords: def2/J RIJCOSX
keywords: DEFGRID2
keywords: scfconv7
keywords: smallprint printgap noloewdin
keywords: NOSOSCF
formula: C10H20NO4PS
InChI: InChI=1/C10H20NO4PS/c1-6-11-16(17,13-5)15-9(4)7-10(12)14-8(2)3/h7-8,11H,6H2,1-5H3
37 atoms
S  -2.988619 -2.273234 0.872824
P  -2.382687 -0.628062 0.075718
O  -0.823585 -0.552599 -0.421394
O  3.594962 0.392914 -0.765953
O  -2.927747 -0.343624 -1.404024
O  3.143694 -0.35111 1.295597
N  -2.683337 0.696793 1.004733
C  5.002755 0.537761 -0.468126
C  -2.029826 2.001151 0.858519
C  0.31849 -0.540482 0.324138
C  5.257535 1.846256 0.254532
C  5.725143 0.46828 -1.796204
C  -2.180156 2.621984 -0.515686
C  1.4095 -0.139902 -0.351388
C  2.769815 -0.057976 0.177674
C  0.221181 -0.986076 1.737329
C  -4.336669 -0.364778 -1.645068
H  5.319132 -0.300125 0.157284
H  -0.97036 1.940726 1.125538
H  -2.49612 2.65007 1.598273
H  -2.922791 0.464325 1.95917
H  4.943284 2.696904 -0.352532
H  6.325828 1.950061 0.446733
H  4.744761 1.897364 1.214369
H  6.799503 0.535827 -1.627411
H  5.438583 1.291315 -2.45286
H  5.529541 -0.472183 -2.312039
H  -3.226644 2.67666 -0.816336
H  -1.786621 3.63744 -0.488205
H  -1.62546 2.084171 -1.283342
H  1.282651 0.151476 -1.386673
H  -0.183521 -1.997463 1.786162
H  -0.45134 -0.340384 2.306043
H  1.187418 -0.974519 2.224254
H  -4.774106 -1.316396 -1.338504
H  -4.841013 0.449458 -1.123469
H  -4.472185 -0.240325 -2.716823
elementType: S P O N C H
totalener: -1488.51902190 hartree
nucrepener: 1590.21230786 hartree
electener: -3078.73132976 hartree
oneelecener: -5205.57956616 hartree
twoeener: 2126.84823640 hartree
cpcmener: -0.03146470 hartree
kineticenergy: 1483.72633134 hartree
xcener: -107.352867930552 hartree
chargesum: -0.0000000
charge: -0.457431 0.617012 -0.293356 -0.301784 -0.345538 -0.520142 -0.243996 0.161223 -0.031963 0.221252 -0.264438 -0.254011 -0.253927 -0.289171 0.523602 -0.249715 -0.114774 0.064332 0.088887 0.105158 0.176869 0.090492 0.097267 0.093282 0.091241 0.089113 0.096826 0.086562 0.101322 0.083452 0.126847 0.116837 0.115735 0.117325 0.109854 0.114988 0.130766
qa: -0.4574 0.6170 -0.2934 -0.3018 -0.3455 -0.5201 -0.2440 0.1612 -0.0320 0.2213 -0.2644 -0.2540 -0.2539 -0.2892 0.5236 -0.2497 -0.1148 0.0643 0.0889 0.1052 0.1769 0.0905 0.0973 0.0933 0.0912 0.0891 0.0968 0.0866 0.1013 0.0835 0.1268 0.1168 0.1157 0.1173 0.1099 0.1150 0.1308
va: 2.0073 5.4976 2.1468 2.1263 2.0679 1.9740 3.0613 3.8109 3.8946 3.7427 3.9049 3.9319 3.9037 3.8598 4.0948 3.8925 3.8359 1.0227 0.9935 0.9942 1.0149 1.0067 1.0058 1.0177 1.0051 1.0067 1.0084 1.0048 1.0076 1.0105 1.0325 1.0119 1.0036 1.0417 1.0066 0.9943 0.9898
dispcorr: -0.017174797 hartree
energy: -1488.536196696578
dipole: 15.17592 -15.63878 -0.46287 17.29619 -14.88579 2.41040 -3.21660 3.02535 -0.19125
magnitude: 2.46188 au
magnitude: 6.25760 debye
