program: Orca
programVersion: 5.0.2
elementType: S P O O O O N C C C C C C C C C C H H H H H H H H H H H H H H H H H H H H
charge: 0
multiplicity: 1
keywords: wb97x-d3
keywords: def2-TZVPP
keywords: def2/J RIJCOSX
keywords: DEFGRID2
keywords: scfconv7
keywords: smallprint printgap noloewdin
keywords: NOSOSCF
formula: C10H20NO4PS
InChI: InChI=1/C10H20NO4PS/c1-6-11-16(17,13-5)15-9(4)7-10(12)14-8(2)3/h7-8,11H,6H2,1-5H3
37 atoms
S  -1.627674 -0.241103 2.429247
P  -2.150478 -0.052573 0.589126
O  -1.384292 -1.058106 -0.466954
O  2.892814 0.550733 0.293163
O  -3.64079 -0.503503 0.217495
O  2.916324 -1.227464 -1.065528
N  -1.993445 1.442832 -0.03331
C  4.331287 0.67886 0.255131
C  -2.237344 1.826399 -1.419666
C  -0.056382 -1.184627 -0.721427
C  4.72235 1.404952 1.524232
C  4.754997 1.428937 -0.992296
C  -1.115289 2.693242 -1.953778
C  0.854345 -0.352753 -0.18792
C  2.300616 -0.424866 -0.393993
C  0.161331 -2.33527 -1.636525
C  -4.127736 -1.810044 0.537023
H  4.77659 -0.318365 0.259402
H  -3.191582 2.35188 -1.49652
H  -2.330052 0.926038 -2.026124
H  -1.840368 2.193879 0.624282
H  5.806945 1.497404 1.569383
H  4.399569 0.861465 2.412634
H  4.299394 2.410053 1.55835
H  4.316514 2.427782 -1.016624
H  4.474202 0.904795 -1.905237
H  5.839507 1.539692 -0.997923
H  -0.164104 2.160986 -1.936323
H  -1.323914 2.985153 -2.982893
H  -1.007053 3.605376 -1.365542
H  0.533044 0.444096 0.467644
H  1.193252 -2.436228 -1.945403
H  -0.461168 -2.221659 -2.52542
H  -0.147798 -3.259357 -1.143445
H  -3.913893 -2.068934 1.574642
H  -5.204344 -1.78916 0.392238
H  -3.693961 -2.562647 -0.120414
elementType: S P O N C H
totalener: -1488.52350114 hartree
nucrepener: 1614.31568642 hartree
electener: -3102.83918755 hartree
oneelecener: -5254.14724750 hartree
twoeener: 2151.30805995 hartree
cpcmener: -0.02988703 hartree
kineticenergy: 1483.75146373 hartree
xcener: -107.358004128141 hartree
chargesum: -0.0000000
charge: -0.455715 0.632043 -0.317375 -0.299282 -0.350395 -0.517256 -0.233576 0.157898 -0.029534 0.322364 -0.255136 -0.261872 -0.249691 -0.300097 0.505979 -0.254763 -0.105120 0.063533 0.098034 0.094745 0.170653 0.091068 0.096972 0.088966 0.089966 0.093106 0.097030 0.082982 0.091064 0.089023 0.086141 0.107108 0.110362 0.112502 0.099420 0.127989 0.120862
qa: -0.4557 0.6320 -0.3174 -0.2993 -0.3504 -0.5173 -0.2336 0.1579 -0.0295 0.3224 -0.2551 -0.2619 -0.2497 -0.3001 0.5060 -0.2548 -0.1051 0.0635 0.0980 0.0947 0.1707 0.0911 0.0970 0.0890 0.0900 0.0931 0.0970 0.0830 0.0911 0.0890 0.0861 0.1071 0.1104 0.1125 0.0994 0.1280 0.1209
va: 1.9966 5.4924 2.1401 2.1233 2.0845 1.9809 3.0911 3.8141 3.8858 3.6461 3.9338 3.9037 3.9388 3.7681 4.1719 3.9472 3.8432 1.0233 0.9987 1.0062 1.0178 1.0055 1.0083 1.0065 1.0068 1.0176 1.0058 1.0011 1.0086 1.0007 1.0805 1.0339 1.0017 0.9997 1.0045 0.9897 0.9915
dispcorr: -0.016863203 hartree
energy: -1488.540364340315
dipole: 13.98250 -14.86870 -0.88620 8.58216 -7.52836 1.05380 -11.11359 9.79352 -1.32007
magnitude: 1.90747 au
magnitude: 4.84839 debye
