program: Orca
programVersion: 5.0.2
elementType: S P O O O O N C C C C C C C C C C H H H H H H H H H H H H H H H H H H H H
charge: 0
multiplicity: 1
keywords: wb97x-d3
keywords: def2-TZVPP
keywords: def2/J RIJCOSX
keywords: DEFGRID2
keywords: scfconv7
keywords: smallprint printgap noloewdin
keywords: NOSOSCF
formula: C10H20NO4PS
InChI: InChI=1/C10H20NO4PS/c1-6-11-16(17,13-5)15-9(4)7-10(12)14-8(2)3/h7-8,11H,6H2,1-5H3
37 atoms
S  -3.889378 -0.155173 1.017944
P  -2.213989 -0.230597 0.078541
O  -1.060596 -0.772441 1.107075
O  3.085453 0.63118 -0.308628
O  -2.022081 -1.336424 -1.069064
O  3.033573 -1.597261 -0.095967
N  -1.785968 1.176618 -0.656494
C  4.47854 0.627546 -0.697831
C  -2.071694 2.494227 -0.097138
C  0.197247 -1.191796 0.724677
C  5.359129 0.564112 0.534247
C  4.697907 1.892824 -1.497462
C  -1.165319 2.903309 1.048237
C  1.094653 -0.261917 0.373304
C  2.482614 -0.518973 -0.023688
C  0.348347 -2.662474 0.845608
C  -2.910344 -1.362542 -2.190334
H  4.665477 -0.239259 -1.335311
H  -3.113471 2.504238 0.222635
H  -1.991241 3.209471 -0.915245
H  -0.955622 1.13733 -1.236596
H  6.406599 0.581764 0.23218
H  5.19933 -0.34707 1.110201
H  5.183546 1.421427 1.186011
H  4.05182 1.931245 -2.374847
H  5.730185 1.926079 -1.844817
H  4.51974 2.784745 -0.894419
H  -1.42443 3.905777 1.390658
H  -1.264543 2.22568 1.897588
H  -0.118254 2.916659 0.742926
H  0.799586 0.779212 0.396502
H  0.035768 -2.9785 1.842571
H  1.363707 -2.998661 0.677197
H  -0.309054 -3.164181 0.132636
H  -2.749373 -0.503727 -2.84168
H  -2.694825 -2.274188 -2.741118
H  -3.951811 -1.381098 -1.866239
elementType: S P O N C H
totalener: -1488.52020371 hartree
nucrepener: 1608.93942396 hartree
electener: -3097.45962767 hartree
oneelecener: -5242.81398700 hartree
twoeener: 2145.35435933 hartree
cpcmener: -0.03284855 hartree
kineticenergy: 1483.72797149 hartree
xcener: -107.349039595466 hartree
chargesum: -0.0000000
charge: -0.461591 0.660218 -0.353557 -0.298220 -0.341916 -0.509227 -0.257933 0.159913 -0.019621 0.255841 -0.261655 -0.256302 -0.257838 -0.270980 0.508051 -0.248712 -0.112116 0.065886 0.086583 0.094824 0.177443 0.097329 0.093203 0.090461 0.097619 0.092074 0.089489 0.103179 0.081696 0.086136 0.138109 0.109936 0.106574 0.108704 0.118690 0.126109 0.101600
qa: -0.4616 0.6602 -0.3536 -0.2982 -0.3419 -0.5092 -0.2579 0.1599 -0.0196 0.2558 -0.2617 -0.2563 -0.2578 -0.2710 0.5081 -0.2487 -0.1121 0.0659 0.0866 0.0948 0.1774 0.0973 0.0932 0.0905 0.0976 0.0921 0.0895 0.1032 0.0817 0.0861 0.1381 0.1099 0.1066 0.1087 0.1187 0.1261 0.1016
va: 2.0017 5.4683 2.0817 2.1320 2.0728 1.9869 3.0898 3.8096 3.8854 3.6868 3.9084 3.9348 3.8794 3.8896 4.1446 3.9479 3.8601 1.0224 1.0219 0.9976 1.0103 1.0057 1.0169 1.0068 1.0080 1.0049 1.0065 1.0107 1.0145 1.0040 1.0191 1.0022 1.0317 1.0083 0.9936 0.9900 1.0013
dispcorr: -0.017063656 hartree
energy: -1488.537267366969
dipole: 20.30417 -18.92642 1.37775 11.12195 -9.56181 1.56015 -6.06832 4.10154 -1.96678
magnitude: 2.86365 au
magnitude: 7.27881 debye
