program: Orca
programVersion: 5.0.2
elementType: S P O O O O N C C C C C C C C C C H H H H H H H H H H H H H H H H H H H H
charge: 0
multiplicity: 1
keywords: wb97x-d3
keywords: def2-TZVPP
keywords: def2/J RIJCOSX
keywords: DEFGRID2
keywords: scfconv7
keywords: smallprint printgap noloewdin
keywords: NOSOSCF
formula: C10H20NO4PS
InChI: InChI=1/C10H20NO4PS/c1-6-11-16(17,13-5)15-9(4)7-10(12)14-8(2)3/h7-8,11H,6H2,1-5H3
37 atoms
S  -1.85268 -0.2522 2.402775
P  -2.14683 -0.294666 0.50361
O  -0.956596 -1.013131 -0.375882
O  3.130175 -0.067317 -0.325087
O  -3.242561 -1.323294 -0.05253
O  2.595854 1.923682 0.544702
N  -2.502875 1.166218 -0.141407
C  4.546956 0.22416 -0.321768
C  -2.732566 1.435349 -1.557833
C  0.36464 -0.714403 -0.440705
C  5.156981 -0.654969 -1.392105
C  5.125679 -0.052152 1.051482
C  -1.551517 2.103164 -2.234369
C  0.869044 0.409801 0.099351
C  2.267029 0.82958 0.125465
C  1.092273 -1.788645 -1.18224
C  -4.590365 -1.220296 0.416653
H  4.695298 1.273038 -0.586731
H  -3.618187 2.066706 -1.642586
H  -2.978433 0.499248 -2.058653
H  -2.260813 1.968723 0.423936
H  4.738662 -0.439253 -2.375621
H  5.007462 -1.713786 -1.174765
H  6.230408 -0.473461 -1.441997
H  4.979342 -1.095699 1.335109
H  4.683669 0.580677 1.820597
H  6.197942 0.144219 1.040923
H  -0.677553 1.452414 -2.25394
H  -1.80545 2.358633 -3.263623
H  -1.27697 3.026472 -1.722029
H  0.213585 1.124057 0.579121
H  1.759315 -1.381391 -1.937652
H  0.381269 -2.44799 -1.675231
H  1.692024 -2.393678 -0.501411
H  -5.072072 -0.317643 0.040342
H  -5.119932 -2.090794 0.038502
H  -4.631815 -1.2257 1.506646
elementType: S P O N C H
totalener: -1488.52049364 hartree
nucrepener: 1616.62805300 hartree
electener: -3105.14854664 hartree
oneelecener: -5258.57598365 hartree
twoeener: 2153.42743701 hartree
cpcmener: -0.03544262 hartree
kineticenergy: 1483.73924424 hartree
xcener: -107.354508569274 hartree
chargesum: 0.0000000
charge: -0.453421 0.621476 -0.295927 -0.288717 -0.351607 -0.528796 -0.233669 0.150797 -0.009263 0.290598 -0.266304 -0.259824 -0.264526 -0.305142 0.486941 -0.220987 -0.115265 0.068555 0.095325 0.096630 0.171449 0.099654 0.090952 0.098952 0.090325 0.092658 0.098495 0.084690 0.098505 0.090411 0.089578 0.102279 0.107766 0.112561 0.119781 0.130228 0.104845
qa: -0.4534 0.6215 -0.2959 -0.2887 -0.3516 -0.5288 -0.2337 0.1508 -0.0093 0.2906 -0.2663 -0.2598 -0.2645 -0.3051 0.4869 -0.2210 -0.1153 0.0686 0.0953 0.0966 0.1714 0.0997 0.0910 0.0990 0.0903 0.0927 0.0985 0.0847 0.0985 0.0904 0.0896 0.1023 0.1078 0.1126 0.1198 0.1302 0.1048
va: 2.0007 5.4898 2.1665 2.1219 2.0736 1.9636 3.0614 3.8133 3.8560 3.6870 3.9280 3.9095 3.9433 3.8411 4.1911 3.9253 3.8505 1.0233 0.9970 1.0069 1.0187 1.0067 1.0055 1.0065 1.0061 1.0180 1.0063 0.9989 1.0094 1.0018 1.0678 1.0070 1.0162 1.0037 0.9884 0.9903 1.0044
dispcorr: -0.017946757 hartree
energy: -1488.538440398924
dipole: 14.08880 -14.91224 -0.82343 1.17717 -1.54306 -0.36589 -14.02918 11.51940 -2.50978
magnitude: 2.66663 au
magnitude: 6.77803 debye
