program: Orca
programVersion: 5.0.2
elementType: S P O O O O N C C C C C C C C C C H H H H H H H H H H H H H H H H H H H H
charge: 0
multiplicity: 1
keywords: wb97x-d3
keywords: def2-TZVPP
keywords: def2/J RIJCOSX
keywords: DEFGRID2
keywords: scfconv7
keywords: smallprint printgap noloewdin
keywords: NOSOSCF
formula: C10H20NO4PS
InChI: InChI=1/C10H20NO4PS/c1-6-11-16(17,13-5)15-9(4)7-10(12)14-8(2)3/h7-8,11H,6H2,1-5H3
37 atoms
S  -1.391444 0.834475 1.648104
P  -2.039946 0.041277 0.01815
O  -0.895668 -0.246452 -1.11577
O  3.401625 0.299852 0.364546
O  -2.637735 -1.443989 0.137348
O  3.053803 -1.826218 -0.246857
N  -3.193127 0.890987 -0.77821
C  4.784494 0.047756 0.703533
C  -3.198655 2.34558 -0.895757
C  0.290837 -0.910106 -0.89099
C  5.170191 1.103466 1.716813
C  5.639762 0.105438 -0.546593
C  -4.613482 2.880682 -0.96644
C  1.305332 -0.188306 -0.401141
C  2.650161 -0.690436 -0.10717
C  0.242304 -2.338076 -1.291747
C  -3.623865 -1.73625 1.132786
H  4.862369 -0.939375 1.164202
H  -2.632581 2.661347 -1.775426
H  -2.687992 2.75613 -0.025503
H  -3.62242 0.410645 -1.562218
H  6.200807 0.942867 2.032152
H  4.540941 1.054519 2.605765
H  5.102351 2.108131 1.296605
H  5.362704 -0.659237 -1.271754
H  6.684349 -0.057436 -0.280413
H  5.565063 1.081982 -1.027429
H  -4.596983 3.965454 -1.071907
H  -5.151214 2.473584 -1.824001
H  -5.174363 2.636046 -0.064426
H  1.1303 0.858104 -0.189927
H  1.225269 -2.789587 -1.340663
H  -0.235837 -2.430247 -2.267687
H  -0.361879 -2.908478 -0.583048
H  -3.26275 -1.483598 2.129904
H  -4.551769 -1.198742 0.937973
H  -3.813306 -2.805119 1.082597
elementType: S P O N C H
totalener: -1488.52049990 hartree
nucrepener: 1580.24905985 hartree
electener: -3068.76955976 hartree
oneelecener: -5186.53102064 hartree
twoeener: 2117.76146089 hartree
cpcmener: -0.02995819 hartree
kineticenergy: 1483.74118472 hartree
xcener: -107.350450292156 hartree
chargesum: 0.0000000
charge: -0.473685 0.711298 -0.364423 -0.296410 -0.359483 -0.511336 -0.258175 0.157835 -0.009984 0.268492 -0.252047 -0.261784 -0.248730 -0.291931 0.525863 -0.239325 -0.112125 0.065211 0.094376 0.081887 0.165565 0.091240 0.096965 0.088978 0.093205 0.097266 0.090531 0.087316 0.087817 0.078691 0.118452 0.108092 0.111583 0.107562 0.103407 0.120070 0.127737
qa: -0.4737 0.7113 -0.3644 -0.2964 -0.3595 -0.5113 -0.2582 0.1578 -0.0100 0.2685 -0.2520 -0.2618 -0.2487 -0.2919 0.5259 -0.2393 -0.1121 0.0652 0.0944 0.0819 0.1656 0.0912 0.0970 0.0890 0.0932 0.0973 0.0905 0.0873 0.0878 0.0787 0.1185 0.1081 0.1116 0.1076 0.1034 0.1201 0.1277
va: 1.9687 5.4504 2.0945 2.1338 2.0838 1.9844 3.1256 3.8128 3.8648 3.6849 3.9317 3.9088 3.9373 3.9388 4.0932 3.9531 3.8505 1.0224 0.9962 1.0197 1.0167 1.0051 1.0084 1.0068 1.0167 1.0057 1.0067 1.0075 1.0013 1.0086 1.0419 1.0296 1.0040 1.0069 1.0024 0.9941 0.9904
dispcorr: -0.015598369 hartree
energy: -1488.536098270336
dipole: 6.01593 -7.62780 -1.61187 5.08149 -4.73915 0.34235 -2.50592 1.38228 -1.12364
magnitude: 1.99447 au
magnitude: 5.06954 debye
