program: Orca
programVersion: 5.0.2
elementType: S P O O O O N C C C C C C C C C C H H H H H H H H H H H H H H H H H H H H
charge: 0
multiplicity: 1
keywords: wb97x-d3
keywords: def2-TZVPP
keywords: def2/J RIJCOSX
keywords: DEFGRID2
keywords: scfconv7
keywords: smallprint printgap noloewdin
keywords: NOSOSCF
formula: C10H20NO4PS
InChI: InChI=1/C10H20NO4PS/c1-6-11-16(17,13-5)15-9(4)7-10(12)14-8(2)3/h7-8,11H,6H2,1-5H3
37 atoms
S  -2.180082 0.421373 1.96989
P  -2.277494 -0.210433 0.155685
O  -1.018115 -1.16127 -0.317013
O  3.057783 -0.224483 0.124527
O  -3.437519 -1.271496 -0.154396
O  2.497289 1.937246 -0.007904
N  -2.415931 0.922729 -1.00981
C  4.474178 0.070929 0.166574
C  -2.791535 2.317655 -0.818979
C  0.314864 -0.897553 -0.279413
C  5.003615 0.291598 -1.236062
C  5.127712 -1.111263 0.847174
C  -1.835575 3.257251 -1.524453
C  0.785017 0.345163 -0.072661
C  2.182625 0.76197 0.007065
C  1.093628 -2.150734 -0.510991
C  -3.561347 -2.475345 0.609593
H  4.63078 0.966979 0.770496
H  -2.797112 2.522721 0.250263
H  -3.810783 2.477055 -1.176701
H  -2.400413 0.601008 -1.971408
H  4.530347 1.140891 -1.727984
H  4.856008 -0.594915 -1.854658
H  6.074077 0.493497 -1.191498
H  4.730068 -1.2679 1.850163
H  6.198112 -0.929544 0.940568
H  4.993091 -2.028724 0.272053
H  -0.821332 3.155022 -1.136984
H  -1.810984 3.06816 -2.598624
H  -2.152412 4.290197 -1.378047
H  0.097578 1.173381 0.032301
H  1.914755 -1.997016 -1.205629
H  0.444406 -2.924169 -0.916424
H  1.513835 -2.526633 0.422873
H  -3.524389 -2.27026 1.680199
H  -4.528385 -2.906324 0.364568
H  -2.777896 -3.186674 0.349914
elementType: S P O N C H
totalener: -1488.51874266 hartree
nucrepener: 1610.34286204 hartree
electener: -3098.86160470 hartree
oneelecener: -5246.21826719 hartree
twoeener: 2147.35666248 hartree
cpcmener: -0.03345144 hartree
kineticenergy: 1483.73390375 hartree
xcener: -107.354760623355 hartree
chargesum: -0.0000000
charge: -0.463585 0.690142 -0.314943 -0.292614 -0.364256 -0.528675 -0.246914 0.146950 -0.008661 0.290386 -0.260799 -0.259349 -0.244473 -0.284867 0.481196 -0.228519 -0.110788 0.072194 0.085362 0.096914 0.161532 0.093236 0.090629 0.100877 0.098387 0.096242 0.089663 0.075483 0.088218 0.090485 0.088929 0.103865 0.106499 0.111538 0.100157 0.128693 0.120868
qa: -0.4636 0.6901 -0.3149 -0.2926 -0.3643 -0.5287 -0.2469 0.1469 -0.0087 0.2904 -0.2608 -0.2593 -0.2445 -0.2849 0.4812 -0.2285 -0.1108 0.0722 0.0854 0.0969 0.1615 0.0932 0.0906 0.1009 0.0984 0.0962 0.0897 0.0755 0.0882 0.0905 0.0889 0.1039 0.1065 0.1115 0.1002 0.1287 0.1209
va: 1.9686 5.4560 2.1657 2.1244 2.1011 1.9574 3.1116 3.8077 3.8393 3.7372 3.9118 3.9314 3.9259 3.8496 4.2013 3.9357 3.8497 1.0223 1.0279 0.9978 1.0213 1.0177 1.0050 1.0059 1.0081 1.0057 1.0050 1.0107 1.0015 1.0095 1.0513 1.0082 1.0145 1.0021 1.0045 0.9892 0.9909
dispcorr: -0.017132356 hartree
energy: -1488.535875019616
dipole: 17.24707 -17.29117 -0.04410 -1.32702 -0.64373 -1.97075 -8.31061 6.51476 -1.79585
magnitude: 2.66662 au
magnitude: 6.77802 debye
