program: Gaussian 09
title: 000066464
version: EM64L-G09RevD.01
frameworkgroup: C1[X(C21H30O)]
method: RPBEPBE
basis: SDD
operation: Freq
keyword: #pfreq=noraman
keyword: PBEPBE/SDD
title: #p freq=noraman PBEPBE/SDD
converged: YES YES NO NO
title: Mulliken charges:
elementType: O C C C C C C C C C C C C C C C C C C C C C H H H H H H H H H H H H H H H H H H H H H H H H H H H H H H
charge: -0.443634 -0.171818 0.354290 -0.129856 -0.112347 0.246822 -0.528748 -0.532177 0.050119 -0.537312 -0.478084 -0.513174 0.487141 -0.641493 -0.800540 -0.480923 -0.817487 -0.463035 -0.461341 0.215931 -0.427304 -0.547375 0.240921 0.229978 0.202592 0.225585 0.195141 0.215837 0.225993 0.220829 0.223595 0.218568 0.211496 0.249274 0.233946 0.208537 0.216787 0.227252 0.220178 0.234169 0.201358 0.205358 0.218809 0.228143 0.217689 0.202719 0.205842 0.210960 0.208123 0.208868 0.337930 0.285870
chargesum: 0.00000
title: Mulliken charges with hydrogens summed into heavy atoms:
elementType: O C C C C C C C C C C C C C C C C C C C C C
charge: -0.105704 0.069103 0.354290 0.100122 0.090245 0.246822 -0.108022 -0.090347 0.050119 -0.092888 -0.048021 -0.029954 0.487141 -0.216169 -0.118941 -0.074207 -0.152846 -0.054474 -0.250381 0.215931 -0.010313 -0.261505
polarizability: 2.53423639e+02 8.64583429e-01 1.95914574e+02 -6.80080101e+00 -5.53611909e+00 1.97620866e+02
1716.lowfreq: -13.9960 -9.0117 -7.3402 -0.0005 0.0002 0.0006 39.3233 54.4868 80.1484
frequency: 39.3030 54.4699 80.0957 99.9996 122.8280 131.4473 149.1455 174.6766 179.3864 202.7199 206.8422 226.9494 231.4740 253.7696 263.4935 275.9519 278.7725 292.1294 306.8984 311.0153 327.8573 361.5515 375.0618 404.4905 411.6995 431.7202 437.8194 442.1702 459.4560 477.6397 491.1686 531.2880 542.5221 572.1410 590.7154 604.9828 621.7704 637.0546 656.3489 661.3570 689.1278 721.1193 775.0038 801.9686 807.8256 814.2866 831.5969 844.1244 865.9544 870.6827 884.9950 911.3500 926.6026 929.3778 950.5418 963.0700 968.4247 973.5748 987.5334 996.3802 1005.5093 1012.1013 1015.6349 1037.5032 1038.4811 1066.0043 1074.1007 1081.1848 1099.7273 1112.5320 1116.8784 1120.2043 1128.2097 1132.8304 1153.5266 1160.8139 1169.4071 1181.8824 1189.2057 1200.1789 1214.7814 1222.2248 1236.0833 1242.6174 1251.8155 1254.5736 1271.1072 1271.8742 1276.3631 1288.6389 1302.4035 1304.0423 1321.8546 1322.9786 1327.5741 1330.1697 1333.5104 1337.2454 1341.6314 1344.9875 1353.0465 1361.4731 1365.5484 1385.9388 1398.1803 1458.2743 1459.7812 1460.6721 1463.9594 1466.9269 1467.5878 1471.3895 1474.5124 1476.4748 1479.7262 1487.4189 1488.3173 1496.3459 1676.1999 2118.6636 2916.4714 2923.8632 2944.7929 2951.8926 2952.5171 2959.1180 2961.8394 2962.3448 2979.9974 2982.4881 2990.7992 2992.7731 2998.3962 3003.1868 3021.5471 3022.5906 3028.6701 3029.3190 3031.2576 3041.2757 3046.9258 3056.7470 3071.4640 3076.4846 3080.8466 3088.2179 3089.1676 3095.6478 3426.9344 3547.2384
redmass: 4.1367 3.6597 2.9053 2.6223 3.6876 3.9474 1.6418 2.6586 1.3007 2.0368 1.6975 3.9151 2.1948 2.8541 1.4194 1.6731 2.5000 2.8346 2.5726 2.2345 2.7089 2.3979 2.9317 3.3637 2.7756 3.2412 3.4947 3.3830 3.6825 4.1156 2.4690 2.5044 3.0854 3.2766 4.6894 3.4572 1.4051 2.8570 1.2454 2.9199 2.7884 2.6273 1.6661 2.1849 2.3066 1.3323 1.8798 1.9218 1.6644 2.1072 2.1133 1.8722 1.8925 1.7534 2.0754 2.2951 2.1847 2.8248 2.2030 2.0567 2.1674 2.0763 2.5663 1.7558 1.9240 2.3358 2.0153 2.6936 1.5570 1.7426 1.8862 2.7786 1.7870 1.8080 1.8468 2.1592 1.7483 1.5877 2.0196 1.9556 1.7639 1.2220 1.4217 1.4793 1.4799 1.3369 1.3868 1.3291 1.5991 1.3793 1.5938 1.4410 1.4189 1.3977 1.4055 1.7130 1.3054 1.4309 1.4986 1.5193 1.4024 1.5183 1.4768 1.2239 1.1997 1.0876 1.0707 1.0783 1.0854 1.0777 1.0849 1.0695 1.0838 1.0876 1.0624 1.0643 1.0768 1.0633 7.6786 6.0724 1.0812 1.0796 1.0647 1.0733 1.0692 1.0630 1.0612 1.0658 1.0481 1.0532 1.0568 1.0627 1.0406 1.0903 1.0988 1.0955 1.1004 1.0624 1.0958 1.1030 1.1007 1.1006 1.0988 1.0982 1.0900 1.0988 1.0995 1.1030 1.1576 1.0660
irintensity: 0.0559 0.1415 0.1131 1.1370 0.1895 0.3549 1.7963 4.8045 0.3916 0.8014 0.0949 0.6345 0.4059 0.7941 100.4206 39.1089 0.2894 3.4379 0.4076 1.5544 0.3860 0.5153 7.5335 2.3396 8.3043 1.9110 0.8974 6.0624 1.4350 8.4237 0.3657 2.6975 0.2618 3.4572 2.2681 0.0494 61.0809 13.1462 60.4180 7.3493 1.6438 1.0522 1.9711 0.8350 2.1303 13.5182 1.0182 5.5198 5.1794 2.6160 11.4683 5.6905 11.0397 4.0677 8.5549 32.5782 4.2499 60.4774 5.8864 36.7063 6.4819 4.8237 3.1728 19.7114 1.9896 3.2859 0.2610 4.2310 1.3794 0.6310 5.2112 14.8036 0.4978 1.2911 7.1928 4.6498 8.9202 1.4354 8.6618 2.0879 3.0665 5.1175 1.1311 1.8635 1.9713 1.8857 26.5472 14.0885 3.5091 3.7351 17.2544 5.8307 0.6101 2.7603 1.1654 1.9587 0.4725 2.7593 0.0254 0.3065 1.4777 1.6579 3.8622 19.2259 27.7723 7.0670 2.1962 10.2998 9.1064 3.0375 12.7234 13.3097 11.8737 2.9501 1.8938 4.4389 15.0046 8.1618 2.3634 3.1121 6.0899 8.8913 50.5468 26.9283 12.4564 30.4415 28.1289 66.0346 20.0298 32.2839 15.8218 31.7761 35.8723 62.6147 24.9006 43.9087 27.7611 28.6901 72.1576 68.0353 50.3283 21.0179 44.0715 32.8918 40.2387 26.8535 41.5468 16.9373 67.0896 8.2080
temp: 298.150 k
press: 1.00000 atm
elementType: 8 6 6 6 6 6 6 6 6 6 6 6 6 6 6 6 6 6 6 6 6 6 1 1 1 1 1 1 1 1 1 1 1 1 1 1 1 1 1 1 1 1 1 1 1 1 1 1 1 1 1 1
symmnumber: 1
zpe: 1198726.2 jmol-1
zpe.correction: 0.456571 hartree
zpe.thermalcorrener: 0.477808 hartree
zpe.thermalcorrenthalpy: 0.478752 hartree
zpe.thermalcorrgfe: 0.409411 hartree
zpe.sumelectzpe: -891.689231 hartree
zpe.sumelectthermal: -891.667994 hartree
zpe.sumelectthermalent: -891.667050 hartree
zpe.sumelectthermalfe: -891.736390 hartree
dipole: -1.2991 -0.7526 0.5876
dipole: 1.6123
quadrupole: -145.4585 -129.0183 -131.3941
quadrupole: -1.8641 2.8504 -1.6058
quadrupole: -10.1682 6.2720 3.8962 -1.8641 2.8504 -1.6058
hfenergy: -892.1458014 hartree
pointgroup: C01 [X(C21H30O1)]
dipole: -0.5036813 -0.3034586 0.2378696 debye
polarizability: 253.1352923|1.4304083|196.0334166|-7.7411975|-5.6484606|197.79037 unknown
InChI: InChI=1S/C21H30O/c1-4-21(22)14-11-18-16-9-8-15-7-5-6-12-19(15,2)17(16)10-13-20(18,21)3/h1,7,16-18,22H,5-6,8-14H2,2-3H3
charge 0 multiplicity 1
52 atoms
O  4.65749 -0.764148 -0.750774
C  1.358506 0.812643 0.084179
C  2.115504 -0.383831 -0.568909
C  -0.110429 0.93259 -0.371019
C  -0.85685 -0.399942 -0.032717
C  -2.392442 -0.375057 -0.426347
C  1.391859 -1.692241 -0.176399
C  -0.105792 -1.645665 -0.586964
C  3.56179 -0.152954 0.041581
C  2.311111 2.021016 -0.123592
C  -0.813729 2.130131 0.308657
C  3.745913 1.40266 -0.057308
C  -3.02798 0.886025 0.195236
C  -2.311363 2.200715 -0.07532
C  2.223339 -0.26869 -2.112095
C  -3.081005 -1.657478 0.141995
C  -2.586378 -0.329451 -1.9746
C  -4.6152 -1.528968 0.252467
C  -4.165328 0.854337 0.945488
C  3.66636 -0.626248 1.440129
C  -4.986244 -0.390021 1.2260
C  3.804512 -1.0399 2.594068
H  1.332305 0.602588 1.177961
H  -0.134565 1.099757 -1.469372
H  -0.83764 -0.479905 1.079841
H  1.463097 -1.834865 0.920196
H  1.873821 -2.571648 -0.651607
H  -0.183658 -1.673171 -1.690335
H  -0.596612 -2.565668 -0.218152
H  2.163145 2.79898 0.645135
H  2.127421 2.494596 -1.106928
H  -0.310465 3.076229 0.028782
H  -0.721744 2.025116 1.410156
H  4.330692 1.604531 -0.971357
H  4.327708 1.784106 0.797514
H  -2.381877 2.453956 -1.154705
H  -2.810811 3.021439 0.473723
H  2.8148 -1.109389 -2.514143
H  1.228516 -0.289202 -2.588177
H  2.729181 0.658712 -2.429895
H  -2.672743 -1.864702 1.153618
H  -2.823707 -2.526362 -0.493131
H  -2.187083 -1.241019 -2.455619
H  -3.660094 -0.260459 -2.22559
H  -2.085136 0.541159 -2.43316
H  -5.05369 -2.486956 0.592595
H  -5.048021 -1.314888 -0.744247
H  -4.53511 1.798533 1.374186
H  -4.823872 -0.7210 2.274944
H  -6.065861 -0.15036 1.149793
H  4.705111 -1.729916 -0.52915
H  3.92305 -1.389817 3.60297
