program: Orca
programVersion: 5.0.2
elementType: S P O O O O N C C C C C C C C C C H H H H H H H H H H H H H H H H H H H H
charge: 0
multiplicity: 1
keywords: wb97x-d3
keywords: def2-TZVPP
keywords: def2/J RIJCOSX
keywords: DEFGRID2
keywords: scfconv7
keywords: smallprint printgap noloewdin
keywords: NOSOSCF
formula: C10H20NO4PS
InChI: InChI=1/C10H20NO4PS/c1-6-11-16(17,13-5)15-9(4)7-10(12)14-8(2)3/h7-8,11H,6H2,1-5H3
37 atoms
S  -3.934621 -0.738626 0.068785
P  -2.107778 -0.143018 0.031168
O  -1.11461 -1.429294 0.248923
O  3.028699 0.581557 -0.336982
O  -1.62851 0.494256 -1.366922
O  3.207477 -1.376471 0.731746
N  -1.67687 0.934682 1.192616
C  4.456549 0.804984 -0.306844
C  -2.598127 1.974997 1.651712
C  0.235223 -1.499145 0.443625
C  4.65163 2.305375 -0.348302
C  5.110756 0.103794 -1.481181
C  -2.845329 3.080735 0.64304
C  1.069657 -0.537042 0.016331
C  2.524369 -0.530728 0.192874
C  0.565401 -2.76189 1.152593
C  -1.846089 -0.195103 -2.602645
H  4.858948 0.414339 0.630168
H  -2.170924 2.38591 2.565417
H  -3.536547 1.49927 1.933944
H  -0.70437 1.221168 1.207661
H  5.716782 2.533902 -0.323612
H  4.188321 2.793924 0.509291
H  4.23867 2.738574 -1.260592
H  4.967912 -0.976129 -1.447154
H  6.184178 0.293732 -1.466524
H  4.717825 0.475879 -2.428549
H  -3.466809 3.86041 1.084516
H  -1.909877 3.540209 0.321941
H  -3.363855 2.707066 -0.240915
H  0.680025 0.31783 -0.519976
H  0.134916 -2.741827 2.155937
H  1.631147 -2.929074 1.235555
H  0.116967 -3.606514 0.627096
H  -2.871186 -0.560503 -2.673182
H  -1.668837 0.522228 -3.399849
H  -1.153981 -1.030467 -2.710284
elementType: S P O N C H
totalener: -1488.51962705 hartree
nucrepener: 1602.73080564 hartree
electener: -3091.25043269 hartree
oneelecener: -5230.29116659 hartree
twoeener: 2139.04073389 hartree
cpcmener: -0.03034100 hartree
kineticenergy: 1483.71642930 hartree
xcener: -107.348290008893 hartree
chargesum: -0.0000000
charge: -0.449925 0.630970 -0.308804 -0.298800 -0.339441 -0.513160 -0.267509 0.158255 -0.029794 0.255336 -0.253260 -0.261884 -0.235458 -0.277501 0.503855 -0.254626 -0.101198 0.063231 0.096300 0.089462 0.180709 0.090788 0.097092 0.088927 0.093967 0.097342 0.090197 0.092343 0.085581 0.070876 0.119901 0.113595 0.106749 0.109329 0.105959 0.128312 0.122283
qa: -0.4499 0.6310 -0.3088 -0.2988 -0.3394 -0.5132 -0.2675 0.1583 -0.0298 0.2553 -0.2533 -0.2619 -0.2355 -0.2775 0.5039 -0.2546 -0.1012 0.0632 0.0963 0.0895 0.1807 0.0908 0.0971 0.0889 0.0940 0.0973 0.0902 0.0923 0.0856 0.0709 0.1199 0.1136 0.1067 0.1093 0.1060 0.1283 0.1223
va: 2.0205 5.4774 2.1487 2.1272 2.0246 1.9837 3.0873 3.8127 3.9022 3.7561 3.9325 3.9110 3.8815 3.7434 4.1666 3.9494 3.8215 1.0240 0.9968 1.0172 1.0103 1.0053 1.0078 1.0071 1.0155 1.0058 1.0067 1.0102 1.0064 1.0176 1.0502 1.0003 1.0328 1.0027 1.0118 0.9896 0.9877
dispcorr: -0.016436653 hartree
energy: -1488.536063707290
dipole: 18.00418 -16.54239 1.46178 12.51121 -10.74235 1.76885 -3.74428 3.14045 -0.60383
magnitude: 2.37282 au
magnitude: 6.03122 debye
