program: Gaussian 09
title: 000066390
version: EM64L-G09RevD.01
frameworkgroup: C1[X(FH3Si)]
method: RPBEPBE
basis: SDD
operation: Freq
keyword: #pfreq=noraman
keyword: PBEPBE/SDD
title: #p freq=noraman PBEPBE/SDD
converged: NO NO NO NO
title: Mulliken charges:
elementType: Si F H H H
charge: 0.726974 -0.485701 -0.080432 -0.080425 -0.080417
chargesum: 0.00000
title: Mulliken charges with hydrogens summed into heavy atoms:
elementType: Si F
charge: 0.485701 -0.485701
polarizability: 2.13976637e+01 -4.57628894e-03 2.23020904e+01 -5.77743912e-04 -1.16168869e-04 2.22989129e+01
1716.lowfreq: 0.0034 0.0045 0.0045 30.1817 33.0029 114.2302 674.7368 675.1457 747.6121
frequency: 674.7081 675.1138 747.6121 905.1676 905.5065 951.0897 2130.8977 2151.8086 2152.4738
redmass: 1.1691 1.1694 10.5485 1.0473 1.0474 1.1166 1.0179 1.0527 1.0527
irintensity: 47.9609 48.1437 37.2127 67.7404 67.9206 186.4327 34.5128 123.8091 123.9339
temp: 298.150 k
press: 1.00000 atm
elementType: 14 9 1 1 1
symmnumber: 1
zpe: 67555.4 jmol-1
zpe.correction: 0.025730 hartree
zpe.thermalcorrener: 0.029056 hartree
zpe.thermalcorrenthalpy: 0.030000 hartree
zpe.thermalcorrgfe: 0.001624 hartree
zpe.sumelectzpe: -390.853876 hartree
zpe.sumelectthermal: -390.850551 hartree
zpe.sumelectthermalent: -390.849607 hartree
zpe.sumelectthermalfe: -390.877983 hartree
dipole: 2.3148 0.0003 -0.0002
dipole: 2.3148
quadrupole: -21.9775 -19.9600 -19.9602
quadrupole: 0.0004 0.0000 0.0000
quadrupole: -1.3449 0.6725 0.6724 0.0004 0.0000 0.0000
hfenergy: -390.879607 hartree
pointgroup: C01 [X(F1H3Si1)]
dipole: 0.9107288 0.0001146 0.0000165 debye
dipolederiv: 1.4264245 -0.0000203 -0.0000205 -0.0000428 1.2281781 0.0000548 0.0001056 0.0000338 1.2281241 -0.7245635 -0.0000041 0.0000807 -0.0000027 -0.484071 0.0000123 -0.0000004 0.0000148 -0.4840903 -0.2339683 -0.0024499 0.0003265 -0.0218858 -0.2749318 0.0081286 0.0032646 0.0082358 -0.2211458 -0.233947 0.0015617 0.0019087 0.0137699 -0.2416891 -0.0273589 0.0173318 -0.0274302 -0.2543902 -0.2339458 0.0009126 -0.0022954 0.0081614 -0.2274862 0.0191631 -0.0207017 0.0191459 -0.2684979 unknown
polarizability: 21.3976622|0.0021972|22.2993002|-0.0038912|-0.0010461|22.3017046 unknown
InChI: InChI=1S/FH3Si/c1-2/h2H3
charge 0 multiplicity 1
5 atoms
Si 0.830515 0.000021 0.00002
F  -0.886252 -0.000117 0.00015
H  1.306915 1.412427 -0.21068
H  1.30683 -0.88832 -1.118128
H  1.306592 -0.524011 1.328538
