program: Orca
programVersion: 5.0.2
elementType: S P O O O O N C C C C C C C C C C H H H H H H H H H H H H H H H H H H H H
charge: 0
multiplicity: 1
keywords: wb97x-d3
keywords: def2-TZVPP
keywords: def2/J RIJCOSX
keywords: DEFGRID2
keywords: scfconv7
keywords: smallprint printgap noloewdin
keywords: NOSOSCF
formula: C10H20NO4PS
InChI: InChI=1/C10H20NO4PS/c1-6-11-16(17,13-5)15-9(4)7-10(12)14-8(2)3/h7-8,11H,6H2,1-5H3
37 atoms
S  -2.718126 -2.066891 -0.616482
P  -2.146074 -0.32228 -0.032667
O  -1.007219 -0.282329 1.133866
O  3.299766 0.580089 -0.172577
O  -1.36138 0.551615 -1.13148
O  3.116628 -1.52319 0.573316
N  -3.323926 0.578088 0.653247
C  4.709472 0.426027 -0.454931
C  -3.187773 1.977709 1.043175
C  0.247851 -0.840115 1.006443
C  5.517032 0.62301 0.812582
C  5.042717 1.451756 -1.516336
C  -3.770739 2.946655 0.033713
C  1.217772 -0.054444 0.52448
C  2.61877 -0.442947 0.334915
C  0.305951 -2.235545 1.50526
C  -1.86134 0.649515 -2.467305
H  4.881803 -0.575196 -0.855705
H  -2.133241 2.196591 1.208884
H  -3.676434 2.106411 2.009724
H  -4.265943 0.226746 0.558723
H  5.356353 1.618742 1.228517
H  6.578431 0.522965 0.584917
H  5.274343 -0.114715 1.57669
H  4.447977 1.303777 -2.41802
H  6.092129 1.356826 -1.793729
H  4.883232 2.469324 -1.156537
H  -3.681138 3.969252 0.401788
H  -3.252084 2.887831 -0.923458
H  -4.829052 2.747042 -0.138853
H  0.966278 0.959956 0.243909
H  1.31546 -2.623363 1.553326
H  -0.288992 -2.88296 0.856884
H  -0.140306 -2.286553 2.499657
H  -2.81578 1.175877 -2.496758
H  -1.12661 1.213653 -3.035856
H  -1.980902 -0.33698 -2.915174
elementType: S P O N C H
totalener: -1488.52139020 hartree
nucrepener: 1593.52096138 hartree
electener: -3082.04235158 hartree
oneelecener: -5212.72531979 hartree
twoeener: 2130.68296821 hartree
cpcmener: -0.02971799 hartree
kineticenergy: 1483.74740597 hartree
xcener: -107.354111889037 hartree
chargesum: 0.0000000
charge: -0.470218 0.638054 -0.354766 -0.297140 -0.341588 -0.510079 -0.238421 0.157986 -0.003776 0.259945 -0.261160 -0.253155 -0.261628 -0.290513 0.525223 -0.234041 -0.107279 0.065181 0.090207 0.091411 0.168303 0.090476 0.097462 0.092680 0.097197 0.091397 0.089447 0.092903 0.083175 0.088033 0.127679 0.107300 0.101008 0.112601 0.115736 0.128264 0.112097
qa: -0.4702 0.6381 -0.3548 -0.2971 -0.3416 -0.5101 -0.2384 0.1580 -0.0038 0.2599 -0.2612 -0.2532 -0.2616 -0.2905 0.5252 -0.2340 -0.1073 0.0652 0.0902 0.0914 0.1683 0.0905 0.0975 0.0927 0.0972 0.0914 0.0894 0.0929 0.0832 0.0880 0.1277 0.1073 0.1010 0.1126 0.1157 0.1283 0.1121
va: 1.9922 5.5109 2.0976 2.1352 2.0322 1.9853 3.1071 3.8125 3.8796 3.6883 3.9074 3.9322 3.9425 3.9482 4.0883 3.9477 3.8322 1.0222 1.0073 0.9983 1.0211 1.0067 1.0057 1.0174 1.0083 1.0051 1.0067 1.0098 1.0000 1.0008 1.0332 1.0329 1.0177 1.0018 0.9860 0.9893 1.0080
dispcorr: -0.016440518 hartree
energy: -1488.537830713593
dipole: 12.51325 -13.16282 -0.64956 15.85109 -13.10495 2.74613 -2.87406 2.45777 -0.41629
magnitude: 2.85245 au
magnitude: 7.25036 debye
