program: Orca
programVersion: 5.0.2
elementType: S P O O O O N C C C C C C C C C C H H H H H H H H H H H H H H H H H H H H
charge: 0
multiplicity: 1
keywords: wb97x-d3
keywords: def2-TZVPP
keywords: def2/J RIJCOSX
keywords: DEFGRID2
keywords: scfconv7
keywords: smallprint printgap noloewdin
keywords: NOSOSCF
formula: C10H20NO4PS
InChI: InChI=1/C10H20NO4PS/c1-6-11-16(17,13-5)15-9(4)7-10(12)14-8(2)3/h7-8,11H,6H2,1-5H3
37 atoms
S  -1.244742 2.525293 -0.632984
P  -1.90856 0.744552 -0.330242
O  -1.146537 -0.46375 -1.138084
O  3.110931 0.078612 0.651444
O  -1.722158 0.159221 1.149595
O  2.953747 -1.65722 -0.757226
N  -3.47322 0.541727 -0.777536
C  4.511152 -0.170183 0.904352
C  -4.144476 -0.739703 -1.012271
C  0.143678 -0.878367 -1.072393
C  4.671288 -1.256858 1.950154
C  5.097053 1.14974 1.358085
C  -4.105886 -1.687798 0.168555
C  1.053754 -0.282128 -0.282859
C  2.442663 -0.716863 -0.182819
C  0.366625 -2.040157 -1.982676
C  -2.057017 0.945897 2.295204
H  4.990779 -0.477494 -0.027644
H  -3.740695 -1.233614 -1.899733
H  -5.180474 -0.492384 -1.237973
H  -3.813773 1.2949 -1.358926
H  5.731713 -1.41408 2.148764
H  4.253738 -2.209634 1.626232
H  4.194214 -0.970966 2.888868
H  6.164346 1.029659 1.541368
H  4.635455 1.493717 2.284988
H  4.976316 1.924829 0.600918
H  -4.477766 -1.211438 1.075765
H  -4.744985 -2.543924 -0.04587
H  -3.10705 -2.075617 0.363767
H  0.787259 0.573348 0.32168
H  0.621601 -2.936584 -1.417938
H  1.181648 -1.848466 -2.677954
H  -0.53276 -2.247768 -2.557892
H  -1.59189 0.467539 3.152868
H  -1.673429 1.962533 2.203516
H  -3.13629 0.979648 2.441828
elementType: S P O N C H
totalener: -1488.52088298 hartree
nucrepener: 1609.85058288 hartree
electener: -3098.37146586 hartree
oneelecener: -5245.54209844 hartree
twoeener: 2147.17063259 hartree
cpcmener: -0.03025728 hartree
kineticenergy: 1483.74085290 hartree
xcener: -107.353940850249 hartree
chargesum: 0.0000000
charge: -0.455569 0.614837 -0.288913 -0.302453 -0.336818 -0.520820 -0.254368 0.163989 -0.024484 0.299234 -0.264971 -0.255387 -0.255577 -0.283998 0.483291 -0.227776 -0.096482 0.063711 0.089411 0.097988 0.173061 0.097605 0.093033 0.090378 0.090753 0.089001 0.096688 0.085054 0.098669 0.081226 0.088710 0.106969 0.104345 0.104924 0.128364 0.107488 0.118886
qa: -0.4556 0.6148 -0.2889 -0.3025 -0.3368 -0.5208 -0.2544 0.1640 -0.0245 0.2992 -0.2650 -0.2554 -0.2556 -0.2840 0.4833 -0.2278 -0.0965 0.0637 0.0894 0.0980 0.1731 0.0976 0.0930 0.0904 0.0908 0.0890 0.0967 0.0851 0.0987 0.0812 0.0887 0.1070 0.1043 0.1049 0.1284 0.1075 0.1189
va: 2.0065 5.4878 2.1685 2.1242 2.0339 1.9794 3.1211 3.8079 3.8992 3.7352 3.9059 3.9327 3.9125 3.8345 4.1970 3.9298 3.8168 1.0230 0.9977 0.9943 1.0164 1.0055 1.0173 1.0066 1.0054 1.0065 1.0082 1.0051 1.0084 1.0106 1.0656 1.0056 1.0074 1.0146 0.9893 1.0119 0.9943
dispcorr: -0.016785217 hartree
energy: -1488.537668192104
dipole: 6.65461 -8.52774 -1.87313 -10.29401 9.62674 -0.66728 9.64015 -8.82458 0.81558
magnitude: 2.14920 au
magnitude: 5.46283 debye
