program: Orca
programVersion: 5.0.2
elementType: S P O O O O N C C C C C C C C C C H H H H H H H H H H H H H H H H H H H H
charge: 0
multiplicity: 1
keywords: wb97x-d3
keywords: def2-TZVPP
keywords: def2/J RIJCOSX
keywords: DEFGRID2
keywords: scfconv7
keywords: smallprint printgap noloewdin
keywords: NOSOSCF
formula: C10H20NO4PS
InChI: InChI=1/C10H20NO4PS/c1-6-11-16(17,13-5)15-9(4)7-10(12)14-8(2)3/h7-8,11H,6H2,1-5H3
37 atoms
S  -1.880545 -0.082478 2.357711
P  -2.138371 0.045524 0.457368
O  -1.006564 -0.727216 -0.455049
O  3.163073 -0.378692 -0.000459
O  -3.409737 -0.721598 -0.145516
O  2.824602 1.711998 0.720352
N  -2.221165 1.560731 -0.14153
C  4.602525 -0.243427 0.067455
C  -2.461114 1.908027 -1.540521
C  0.347287 -0.620099 -0.421374
C  5.120706 0.460185 -1.170359
C  5.148949 -1.647851 0.200886
C  -3.906218 2.260764 -1.830704
C  0.956315 0.415047 0.182049
C  2.391603 0.6494 0.314509
C  0.970559 -1.769389 -1.141845
C  -3.631442 -2.109708 0.118021
H  4.860652 0.329977 0.960234
H  -2.136932 1.079501 -2.16991
H  -1.812619 2.748896 -1.789215
H  -2.413952 2.288466 0.532941
H  4.731168 1.47299 -1.267331
H  4.866972 -0.097107 -2.073527
H  6.207438 0.531206 -1.116511
H  4.907904 -2.257333 -0.671457
H  4.762831 -2.145284 1.090904
H  6.234212 -1.606991 0.289863
H  -4.014277 2.571838 -2.870461
H  -4.568348 1.411812 -1.66181
H  -4.242467 3.086136 -1.201563
H  0.363768 1.205792 0.620368
H  1.36544 -2.501274 -0.435624
H  1.786968 -1.454734 -1.785602
H  0.225898 -2.271492 -1.756138
H  -4.658968 -2.325158 -0.162749
H  -2.960773 -2.732622 -0.473636
H  -3.497552 -2.337342 1.176301
elementType: S P O N C H
totalener: -1488.52061771 hartree
nucrepener: 1605.45156959 hartree
electener: -3093.97218729 hartree
oneelecener: -5236.35971584 hartree
twoeener: 2142.38752854 hartree
cpcmener: -0.03349013 hartree
kineticenergy: 1483.74038316 hartree
xcener: -107.354255931884 hartree
chargesum: 0.0000000
charge: -0.452640 0.636757 -0.308133 -0.292515 -0.344121 -0.528916 -0.243161 0.147899 -0.015687 0.284728 -0.260374 -0.260010 -0.250707 -0.277020 0.482754 -0.225759 -0.103902 0.071922 0.094055 0.095316 0.168250 0.092957 0.090981 0.100247 0.089666 0.098812 0.096094 0.090151 0.078699 0.085438 0.090332 0.111597 0.102988 0.107862 0.125987 0.119990 0.099462
qa: -0.4526 0.6368 -0.3081 -0.2925 -0.3441 -0.5289 -0.2432 0.1479 -0.0157 0.2847 -0.2604 -0.2600 -0.2507 -0.2770 0.4828 -0.2258 -0.1039 0.0719 0.0941 0.0953 0.1682 0.0930 0.0910 0.1002 0.0897 0.0988 0.0961 0.0902 0.0787 0.0854 0.0903 0.1116 0.1030 0.1079 0.1260 0.1200 0.0995
va: 2.0008 5.4858 2.1368 2.1209 2.0857 1.9601 3.1009 3.8082 3.8745 3.7171 3.9102 3.9318 3.9396 3.8520 4.1917 3.9357 3.8435 1.0223 1.0098 0.9959 1.0200 1.0186 1.0049 1.0057 1.0051 1.0078 1.0059 1.0080 1.0133 1.0014 1.0731 1.0026 1.0098 1.0136 0.9897 0.9909 1.0058
dispcorr: -0.017138418 hartree
energy: -1488.537756123929
dipole: 11.86334 -12.35571 -0.49237 -3.31823 2.11697 -1.20126 -15.09684 12.61901 -2.47783
magnitude: 2.79734 au
magnitude: 7.11027 debye
