program: Orca
programVersion: 5.0.2
elementType: S P O O O O N C C C C C C C C C C H H H H H H H H H H H H H H H H H H H H
charge: 0
multiplicity: 1
keywords: wb97x-d3
keywords: def2-TZVPP
keywords: def2/J RIJCOSX
keywords: DEFGRID2
keywords: scfconv7
keywords: smallprint printgap noloewdin
keywords: NOSOSCF
formula: C10H20NO4PS
InChI: InChI=1/C10H20NO4PS/c1-6-11-16(17,13-5)15-9(4)7-10(12)14-8(2)3/h7-8,11H,6H2,1-5H3
37 atoms
S  -1.223952 2.509008 -0.852188
P  -1.869529 0.764943 -0.35759
O  -1.158435 -0.487578 -1.142932
O  3.120343 0.10678 0.547321
O  -1.587912 0.261935 1.140175
O  2.996714 -1.700323 -0.765592
N  -3.454032 0.52339 -0.67722
C  4.499315 -0.160655 0.888969
C  -4.31269 -0.474584 -0.036377
C  0.121783 -0.942132 -1.078538
C  4.564985 -1.167226 2.020988
C  5.107578 1.171781 1.268675
C  -3.916438 -1.910052 -0.318112
C  1.083279 -0.288263 -0.405081
C  2.469775 -0.731644 -0.258068
C  0.224461 -2.20964 -1.847968
C  -1.784356 1.150141 2.245159
H  5.014181 -0.554275 0.010041
H  -5.313606 -0.294357 -0.424245
H  -4.363544 -0.306545 1.042281
H  -3.926364 1.311901 -1.093308
H  5.606718 -1.344635 2.289146
H  4.129096 -2.127739 1.747237
H  4.050318 -0.794039 2.907797
H  5.058543 1.884749 0.445265
H  6.158242 1.031028 1.521403
H  4.610777 1.607463 2.136918
H  -2.964497 -2.177043 0.140181
H  -4.671585 -2.577219 0.097878
H  -3.851671 -2.103474 -1.388719
H  0.854568 0.643649 0.093603
H  -0.10079 -2.041075 -2.876293
H  -0.446449 -2.956041 -1.417794
H  1.228522 -2.611858 -1.864349
H  -2.841986 1.371908 2.39137
H  -1.39933 0.642564 3.126024
H  -1.236971 2.081848 2.10092
elementType: S P O N C H
totalener: -1488.52089266 hartree
nucrepener: 1611.68744599 hartree
electener: -3100.20833864 hartree
oneelecener: -5249.22981036 hartree
twoeener: 2149.02147171 hartree
cpcmener: -0.03151586 hartree
kineticenergy: 1483.74120123 hartree
xcener: -107.354990788297 hartree
chargesum: -0.0000000
charge: -0.458884 0.610056 -0.306885 -0.300634 -0.342943 -0.516060 -0.243249 0.158308 -0.029045 0.302792 -0.262348 -0.254575 -0.246446 -0.276257 0.497374 -0.256282 -0.101514 0.064175 0.097864 0.088619 0.174749 0.097097 0.093433 0.090406 0.097104 0.090979 0.088791 0.076880 0.097478 0.084175 0.090235 0.111298 0.111701 0.109155 0.122340 0.130567 0.109545
qa: -0.4589 0.6101 -0.3069 -0.3006 -0.3429 -0.5161 -0.2432 0.1583 -0.0290 0.3028 -0.2623 -0.2546 -0.2464 -0.2763 0.4974 -0.2563 -0.1015 0.0642 0.0979 0.0886 0.1747 0.0971 0.0934 0.0904 0.0971 0.0910 0.0888 0.0769 0.0975 0.0842 0.0902 0.1113 0.1117 0.1092 0.1223 0.1306 0.1095
va: 2.0023 5.5110 2.1654 2.1251 2.0238 1.9806 3.1274 3.8130 3.9116 3.7029 3.9075 3.9335 3.8909 3.7867 4.1964 3.9411 3.8232 1.0234 0.9939 0.9937 1.0177 1.0058 1.0166 1.0067 1.0080 1.0053 1.0067 1.0124 1.0093 1.0081 1.0678 1.0017 0.9985 1.0348 0.9871 0.9893 1.0080
dispcorr: -0.016844612 hartree
energy: -1488.537737267461
dipole: 6.29625 -8.32910 -2.03285 -9.90977 9.52443 -0.38534 11.31573 -9.67012 1.64561
magnitude: 2.64367 au
magnitude: 6.71968 debye
