program: Orca
programVersion: 5.0.2
elementType: S P O O O O N C C C C C C C C C C H H H H H H H H H H H H H H H H H H H H
charge: 0
multiplicity: 1
keywords: wb97x-d3
keywords: def2-TZVPP
keywords: def2/J RIJCOSX
keywords: DEFGRID2
keywords: scfconv7
keywords: smallprint printgap noloewdin
keywords: NOSOSCF
formula: C10H20NO4PS
InChI: InChI=1/C10H20NO4PS/c1-6-11-16(17,13-5)15-9(4)7-10(12)14-8(2)3/h7-8,11H,6H2,1-5H3
37 atoms
S  -2.815892 -0.605492 1.683691
P  -2.245107 -0.478488 -0.151781
O  -1.027983 -1.479766 -0.596548
O  3.127552 0.480949 -0.779367
O  -3.240575 -1.078832 -1.257271
O  2.892459 -0.813184 1.033912
N  -1.859974 1.045096 -0.625238
C  4.463393 0.885597 -0.397336
C  -1.639121 2.175887 0.271005
C  0.210315 -1.414842 0.004102
C  4.3997 2.006257 0.621133
C  5.15745 1.307838 -1.67391
C  -0.251036 2.24324 0.877542
C  1.107944 -0.583698 -0.539689
C  2.446757 -0.348592 0.005304
C  0.369309 -2.325851 1.170064
C  -4.608907 -0.665477 -1.255206
H  4.984558 0.025092 0.027665
H  -2.39091 2.134886 1.057575
H  -1.842065 3.07926 -0.304231
H  -1.40969 1.127465 -1.530567
H  3.908108 1.701771 1.544578
H  3.874107 2.873472 0.218464
H  5.412152 2.319199 0.877326
H  6.188621 1.580923 -1.451622
H  4.673301 2.173988 -2.127603
H  5.179953 0.499079 -2.404472
H  -0.160124 3.137537 1.495712
H  -0.052885 1.376936 1.509997
H  0.522313 2.288341 0.109826
H  0.829905 -0.015081 -1.417929
H  1.366896 -2.751001 1.220702
H  -0.351759 -3.138174 1.10846
H  0.184493 -1.791014 2.103929
H  -4.70326 0.416472 -1.356006
H  -5.079728 -1.141775 -2.111273
H  -5.113565 -0.987362 -0.343946
elementType: S P O N C H
totalener: -1488.51932414 hartree
nucrepener: 1627.00282361 hartree
electener: -3115.52214776 hartree
oneelecener: -5279.33822292 hartree
twoeener: 2163.81607516 hartree
cpcmener: -0.03187055 hartree
kineticenergy: 1483.73905424 hartree
xcener: -107.352403224772 hartree
chargesum: -0.0000000
charge: -0.475602 0.701026 -0.344765 -0.298853 -0.359112 -0.510671 -0.271806 0.161459 -0.002930 0.255715 -0.268765 -0.253353 -0.238774 -0.313537 0.518640 -0.239067 -0.120900 0.066013 0.084388 0.097980 0.170578 0.094632 0.090998 0.101993 0.091142 0.088911 0.097280 0.102906 0.070268 0.077383 0.138550 0.113533 0.110920 0.108876 0.117435 0.130065 0.107443
qa: -0.4756 0.7010 -0.3448 -0.2989 -0.3591 -0.5107 -0.2718 0.1615 -0.0029 0.2557 -0.2688 -0.2534 -0.2388 -0.3135 0.5186 -0.2391 -0.1209 0.0660 0.0844 0.0980 0.1706 0.0946 0.0910 0.1020 0.0911 0.0889 0.0973 0.1029 0.0703 0.0774 0.1385 0.1135 0.1109 0.1089 0.1174 0.1301 0.1074
va: 1.9587 5.4674 2.1065 2.1281 2.0793 1.9834 3.1061 3.8129 3.8549 3.7279 3.9025 3.9320 3.8944 3.9595 4.0589 3.9423 3.8582 1.0224 1.0243 0.9969 1.0165 1.0165 1.0059 1.0063 1.0054 1.0064 1.0084 1.0106 1.0119 1.0076 1.0192 1.0157 1.0114 1.0064 0.9922 0.9914 0.9995
dispcorr: -0.018419623 hartree
energy: -1488.537743766377
dipole: 17.24149 -16.96472 0.27678 15.12286 -13.16773 1.95513 -1.73969 -0.20274 -1.94244
magnitude: 2.76987 au
magnitude: 7.04045 debye
