program: Gaussian 09
title: 000066432
version: EM64L-G09RevD.01
frameworkgroup: C1[X(C20H28O2)]
method: RPBEPBE
basis: SDD
operation: Freq
keyword: #pfreq=noraman
keyword: PBEPBE/SDD
title: #p freq=noraman PBEPBE/SDD
converged: YES YES NO NO
title: Mulliken charges:
elementType: O O C C C C C C C C C C C C C C C C C C C C H H H H H H H H H H H H H H H H H H H H H H H H H H H H
charge: -0.453748 -0.268374 0.435757 -0.159109 -0.102365 -0.156056 -0.213440 -0.557316 -0.552445 -0.474429 -0.461102 -0.455705 -0.511987 0.251895 -0.580162 0.301797 -0.749356 -0.378187 -0.545665 -0.415062 0.318275 -0.536135 0.213181 0.230056 0.200671 0.200295 0.187261 0.237322 0.207720 0.232308 0.228202 0.185554 0.224512 0.201714 0.216200 0.204358 0.219089 0.214278 0.222317 0.225783 0.274036 0.208942 0.202291 0.337016 0.219954 0.253332 0.237455 0.218807 0.242048 0.218214
chargesum: 0.00000
title: Mulliken charges with hydrogens summed into heavy atoms:
elementType: O O C C C C C C C C C C C C C C C C C C C C
charge: -0.116732 -0.268374 0.435757 0.054072 0.127691 0.044614 -0.013145 -0.132733 -0.112416 -0.060673 -0.034876 -0.035147 -0.078619 0.251895 -0.132062 0.301797 -0.064087 -0.158233 -0.292333 -0.177607 0.318275 0.142935
polarizability: 2.93202730e+02 -9.92942807e+00 2.05992856e+02 7.47292324e+00 8.42507966e+00 1.52235702e+02
1716.lowfreq: -5.1718 -0.0003 0.0005 0.0008 3.5444 7.6538 27.5335 56.7068 76.6922
frequency: 27.4782 56.6567 76.6686 94.0500 105.4983 117.3070 138.6167 166.9888 182.1745 197.2569 211.0015 218.8749 227.0364 237.4245 248.3665 266.5562 279.6901 281.4462 308.1940 343.3215 347.4416 363.7476 386.5305 406.2723 438.4340 442.3148 444.4505 484.0767 499.8556 513.4548 544.2807 565.6897 569.1015 592.3594 616.1208 650.0471 686.4919 710.0809 717.9719 765.4806 776.2377 808.2226 819.3032 829.7847 851.2300 852.8792 877.3152 892.7210 912.4782 930.6086 935.7600 950.4311 977.5944 981.6621 999.9261 1007.4649 1016.5021 1019.7044 1033.9483 1044.6785 1058.9473 1062.4463 1080.2845 1085.5822 1105.3201 1111.8570 1119.4311 1131.9835 1134.9367 1145.7219 1163.3481 1167.9055 1177.2631 1182.1975 1192.4423 1197.6141 1206.8157 1216.4410 1231.6899 1241.1571 1250.7111 1254.8012 1260.9493 1273.2515 1276.7929 1286.9193 1292.8892 1303.5890 1314.3285 1315.6295 1324.2841 1328.6806 1335.3754 1343.0081 1344.6254 1355.4462 1373.1284 1379.1890 1384.1013 1402.9106 1421.7035 1437.2180 1455.7905 1457.7538 1465.8688 1466.3561 1470.1703 1471.1608 1475.6603 1482.9970 1485.5891 1489.3621 1494.1390 1497.9414 1576.2143 1624.2747 2893.4626 2898.8432 2924.9584 2954.8108 2954.9699 2958.0621 2958.7169 2969.6689 2979.6372 2982.6872 2986.3693 2992.2937 3004.6017 3018.5043 3030.7509 3035.0682 3039.5335 3040.0274 3045.9655 3046.5997 3063.0546 3069.4562 3107.6558 3120.5055 3135.1756 3136.9267 3160.9284 3561.0442
redmass: 3.8760 3.8181 3.4547 2.5874 4.3877 2.6388 2.8886 2.9424 2.1715 3.4013 1.8454 2.2357 3.5016 1.4659 2.2449 1.8374 1.7478 1.4841 2.9329 2.3268 3.7324 3.2695 2.8685 3.2619 3.4688 3.3901 3.0923 2.6387 3.9300 3.6698 4.0185 2.6687 3.8776 2.6089 3.3729 2.9228 2.4722 4.7778 3.3589 1.3597 2.1887 1.5423 1.7448 1.9458 1.8773 2.0810 3.7449 1.6295 2.1279 1.4291 1.8598 2.3737 2.7874 1.8317 3.2588 3.1482 2.0379 1.9520 3.1313 1.9273 2.5567 2.5612 2.6201 1.8363 2.2583 1.2611 1.8918 1.6699 2.0588 1.4996 1.5277 1.9035 1.4635 1.4148 1.3432 1.7047 1.8356 1.3371 1.3833 1.4914 2.6095 1.4578 1.4682 1.2901 1.3283 1.3152 1.3102 1.3676 1.3686 1.4148 1.4442 1.4679 1.3743 1.4794 1.4301 1.5132 3.2609 1.9121 1.2475 1.3943 3.1775 1.2525 1.1286 1.0754 1.0503 1.0725 1.0824 1.0897 1.0765 1.0805 1.0890 1.0562 2.4736 1.0576 7.1884 6.8132 1.0808 1.0791 1.0842 1.0499 1.0603 1.0646 1.0680 1.0671 1.0420 1.0568 1.0587 1.0589 1.0632 1.0941 1.0996 1.1010 1.0996 1.1035 1.1026 1.0947 1.0985 1.1038 1.0989 1.0990 1.0894 1.0886 1.0951 1.0661
irintensity: 0.5776 0.5005 4.0445 2.0584 0.6654 1.5711 1.4898 0.5261 0.5299 0.5712 0.9981 0.5515 0.3826 1.4940 4.4954 50.6871 4.3034 71.6756 13.3550 1.4162 3.9815 0.4572 1.1288 3.9602 1.7303 1.5584 4.7402 1.9680 1.0959 6.5790 7.3729 4.0970 0.3444 8.4162 0.6369 2.2874 3.4435 3.6310 2.3276 12.2158 14.7225 30.0905 2.0154 0.5712 1.4375 16.5553 1.6066 33.7940 6.5638 3.6974 10.6350 4.5932 2.4743 14.6209 54.6700 32.7404 41.9454 0.6810 23.9289 7.0276 2.5145 3.5477 4.5780 4.0781 12.1072 0.2141 6.2232 15.1386 10.3049 7.5454 24.7598 9.9464 15.9553 2.7967 19.0422 1.5150 12.8530 11.3779 8.9945 34.6435 89.5431 2.0377 4.1808 19.5604 4.3042 0.7499 5.3593 7.0790 7.2943 1.9539 0.5868 0.8330 3.0718 1.2938 0.8614 4.7637 12.0422 2.1237 16.3813 4.0093 26.1227 2.4811 11.2073 1.3198 12.4670 15.4425 5.7307 7.7500 52.7028 4.4454 10.6297 7.0387 110.6120 5.7214 24.7715 69.7839 4.1118 20.9792 54.5524 61.9308 20.9547 34.3482 42.1937 58.9483 48.6792 13.3133 23.5299 47.5525 43.2678 38.5038 39.4923 34.8821 47.4901 63.2103 6.7686 49.5541 50.7196 73.8438 14.5818 31.4969 18.7368 1.2251 19.0895 3.3838
temp: 298.150 k
press: 1.00000 atm
elementType: 8 8 6 6 6 6 6 6 6 6 6 6 6 6 6 6 6 6 6 6 6 6 1 1 1 1 1 1 1 1 1 1 1 1 1 1 1 1 1 1 1 1 1 1 1 1 1 1 1 1
symmnumber: 1
zpe: 1144250.4 jmol-1
zpe.correction: 0.435822 hartree
zpe.thermalcorrener: 0.456446 hartree
zpe.thermalcorrenthalpy: 0.457390 hartree
zpe.thermalcorrgfe: 0.388135 hartree
zpe.sumelectzpe: -927.681162 hartree
zpe.sumelectthermal: -927.660538 hartree
zpe.sumelectthermalent: -927.659594 hartree
zpe.sumelectthermalfe: -927.728850 hartree
dipole: -0.5403 0.3356 -1.3245
dipole: 1.4693
quadrupole: -118.8564 -130.7685 -133.7847
quadrupole: -16.9544 3.9676 2.1761
quadrupole: 8.9468 -2.9653 -5.9815 -16.9544 3.9676 2.1761
hfenergy: -928.1169843 hartree
pointgroup: C01 [X(C20H28O2)]
dipole: 0.2112903 -0.1325748 -0.5214995 debye
polarizability: 292.9388154|-11.0390268|206.3417966|-7.5012679|-8.1016533|152.1506751 unknown
InChI: InChI=1S/C20H28O2/c1-3-20-11-10-16-15-7-5-14(22-2)12-13(15)4-6-17(16)18(20)8-9-19(20)21/h5,7,12,16-19,21H,3-4,6,8-11H2,1-2H3
charge 0 multiplicity 1
50 atoms
O  5.312061 1.03844 -0.268305
O  -5.758864 0.031716 0.403075
C  2.876683 0.435323 -0.117932
C  2.16346 -0.941502 -0.360888
C  0.685299 -0.949878 0.068666
C  -0.070961 0.165596 -0.719384
C  4.286841 0.053825 -0.648904
C  2.126088 1.501363 -0.947554
C  3.145929 -1.987635 0.231004
C  0.621967 1.550503 -0.567217
C  4.557609 -1.379505 -0.076216
C  2.939946 0.807763 1.403431
C  -0.017911 -2.302937 -0.172393
C  -1.572338 0.167181 -0.387335
C  -1.435852 -2.281766 0.435986
C  -2.215733 -1.006742 0.117088
C  3.337285 2.268157 1.723539
C  -2.375588 1.309382 -0.622065
C  -3.605883 -0.995955 0.3606
C  -3.76657 1.327434 -0.377586
C  -4.386182 0.15678 0.119463
C  -6.600958 1.204165 0.166973
H  2.162995 -1.094548 -1.466747
H  0.614964 -0.728516 1.155521
H  0.027135 -0.111786 -1.796373
H  4.231504 -0.000162 -1.760778
H  2.215158 1.243542 -2.025008
H  2.583079 2.499603 -0.824186
H  3.013927 -2.986292 -0.221459
H  2.989139 -2.097752 1.32085
H  0.500611 1.910072 0.47366
H  0.124668 2.295204 -1.216989
H  5.165676 -1.288402 0.843059
H  5.127838 -2.000206 -0.791924
H  3.664763 0.13701 1.902407
H  1.959902 0.600878 1.874347
H  0.563329 -3.130738 0.276576
H  -0.07065 -2.49612 -1.264041
H  -1.350082 -2.372616 1.539286
H  -2.015606 -3.163575 0.101187
H  4.291474 2.525487 1.236959
H  2.566607 2.987389 1.389762
H  3.454613 2.397341 2.816278
H  6.177421 0.762497 -0.662628
H  -1.913646 2.22321 -1.009622
H  -4.109035 -1.890718 0.744823
H  -4.339644 2.238034 -0.576213
H  -6.286029 2.061889 0.793811
H  -7.616967 0.892055 0.45086
H  -6.587968 1.504313 -0.899565
