program: Orca
programVersion: 5.0.2
elementType: S P O O O O N C C C C C C C C C C H H H H H H H H H H H H H H H H H H H H
charge: 0
multiplicity: 1
keywords: wb97x-d3
keywords: def2-TZVPP
keywords: def2/J RIJCOSX
keywords: DEFGRID2
keywords: scfconv7
keywords: smallprint printgap noloewdin
keywords: NOSOSCF
formula: C10H20NO4PS
InChI: InChI=1/C10H20NO4PS/c1-6-11-16(17,13-5)15-9(4)7-10(12)14-8(2)3/h7-8,11H,6H2,1-5H3
37 atoms
S  -2.315052 -0.35258 1.894243
P  -2.303995 -0.169304 -0.024249
O  -1.23278 -1.163322 -0.778304
O  2.876264 0.834958 -0.399088
O  -3.614061 -0.656661 -0.807762
O  2.922212 -1.220843 0.487987
N  -2.076495 1.346274 -0.588931
C  4.244864 1.10901 -0.016825
C  -1.817075 2.535401 0.212307
C  0.051341 -1.340475 -0.313961
C  4.360945 2.615614 0.067039
C  5.20197 0.510084 -1.027636
C  -0.352479 2.916408 0.279737
C  0.933022 -0.358697 -0.540511
C  2.327963 -0.3371 -0.092606
C  0.229285 -2.656621 0.343234
C  -4.082133 -2.002273 -0.671514
H  4.429017 0.678382 0.969692
H  -2.208874 2.36208 1.213004
H  -2.399636 3.354474 -0.211026
H  -1.870928 1.438948 -1.577466
H  4.171721 3.087261 -0.89874
H  5.370425 2.884873 0.377833
H  3.667177 3.03059 0.798794
H  5.124083 -0.575626 -1.077853
H  6.226417 0.751279 -0.742294
H  5.02866 0.917871 -2.024599
H  -0.236836 3.852118 0.828493
H  0.234609 2.152098 0.789811
H  0.067482 3.063258 -0.71661
H  0.595934 0.516496 -1.080002
H  1.260234 -2.868693 0.597425
H  -0.138735 -3.444639 -0.316803
H  -0.374885 -2.695171 1.252719
H  -3.436349 -2.700836 -1.203129
H  -4.145026 -2.295647 0.377368
H  -5.076883 -2.036197 -1.108021
elementType: S P O N C H
totalener: -1488.52047702 hartree
nucrepener: 1624.39176170 hartree
electener: -3112.91223873 hartree
oneelecener: -5274.26816991 hartree
twoeener: 2161.35593118 hartree
cpcmener: -0.03020964 hartree
kineticenergy: 1483.74098246 hartree
xcener: -107.354092583191 hartree
chargesum: 0.0000000
charge: -0.476300 0.695400 -0.364534 -0.296248 -0.360767 -0.510635 -0.256042 0.157763 0.006948 0.260622 -0.259377 -0.262295 -0.264172 -0.306547 0.527688 -0.230186 -0.109569 0.065737 0.080085 0.096378 0.165850 0.090630 0.094444 0.097479 0.093614 0.097865 0.091077 0.100632 0.073641 0.091522 0.143200 0.106935 0.111218 0.098217 0.118647 0.101075 0.130005
qa: -0.4763 0.6954 -0.3645 -0.2962 -0.3608 -0.5106 -0.2560 0.1578 0.0069 0.2606 -0.2594 -0.2623 -0.2642 -0.3065 0.5277 -0.2302 -0.1096 0.0657 0.0801 0.0964 0.1659 0.0906 0.0944 0.0975 0.0936 0.0979 0.0911 0.1006 0.0736 0.0915 0.1432 0.1069 0.1112 0.0982 0.1186 0.1011 0.1300
va: 1.9528 5.4677 2.0686 2.1276 2.0951 1.9852 3.1562 3.8161 3.8494 3.7098 3.9316 3.9069 3.9048 3.9172 4.0923 3.9472 3.8455 1.0218 1.0257 0.9974 1.0188 1.0066 1.0061 1.0068 1.0172 1.0058 1.0067 1.0116 1.0101 1.0032 1.0155 1.0326 1.0016 1.0162 0.9931 1.0051 0.9902
dispcorr: -0.017864109 hartree
energy: -1488.538341133553
dipole: 18.02840 -17.96001 0.06838 9.97620 -8.87151 1.10469 -3.75921 1.95304 -1.80617
magnitude: 2.11831 au
magnitude: 5.38432 debye
