program: Gaussian 09
title: 000066394
version: EM64L-G09RevD.01
frameworkgroup: C1[X(C17H22O3)]
method: RPBEPBE
basis: SDD
operation: Freq
keyword: #pfreq=noraman
keyword: PBEPBE/SDD
title: #p freq=noraman PBEPBE/SDD
converged: YES YES NO NO
title: Mulliken charges:
elementType: O O O C C C C C C C C C C C C C C C C C H H H H H H H H H H H H H H H H H H H H H H
charge: -0.264012 -0.447716 -0.438286 0.402012 -0.195488 -0.074249 -0.187510 -0.521737 -0.488975 -0.235796 -0.503675 -0.346320 -0.814186 0.255986 -0.573381 0.308308 -0.345599 -0.536711 -0.447414 0.287901 0.191481 0.260771 0.208186 0.194203 0.227675 0.224892 0.194759 0.220817 0.246793 0.206739 0.200404 0.222315 0.244912 0.257069 0.218163 0.226753 0.228311 0.345507 0.221751 0.255854 0.217512 0.351981
chargesum: 0.00000
title: Mulliken charges with hydrogens summed into heavy atoms:
elementType: O O O C C C C C C C C C C C C C C C C C
charge: -0.264012 -0.102209 -0.086304 0.402012 -0.004007 0.186522 0.020676 -0.099858 -0.069325 -0.014979 -0.050143 0.076399 -0.094042 0.255986 -0.118318 0.308308 -0.123848 -0.280857 -0.229903 0.287901
polarizability: 2.54340969e+02 -6.93215290e+00 1.79307573e+02 7.62340744e+00 4.89248686e+00 1.23841322e+02
1716.lowfreq: -13.5319 -2.1853 -0.0005 0.0003 0.0005 8.5540 34.7193 57.8012 97.5603
frequency: 34.6065 57.7818 97.5123 115.0685 121.1417 166.8372 185.0535 206.1041 214.8561 229.8160 234.3090 239.3288 267.5328 282.4730 302.3109 339.3472 340.4117 351.2011 371.9720 397.8913 433.2633 440.7451 444.1964 464.6669 487.3561 513.2012 544.1377 556.9259 575.0079 602.6887 627.8546 650.0102 706.8094 721.8152 751.9815 773.6346 804.3749 832.4101 845.7073 855.9654 880.3569 893.6159 904.2652 923.2631 925.0468 935.2873 964.6614 969.7055 977.0948 1000.0104 1019.8826 1023.8588 1033.6907 1050.3660 1071.8222 1101.3354 1101.9094 1121.9805 1134.1951 1138.4104 1150.2442 1158.2970 1176.1681 1177.8746 1185.1592 1197.3239 1206.7874 1217.8709 1234.5199 1249.2974 1256.4659 1264.5238 1278.7479 1288.0616 1291.8519 1294.3279 1312.2007 1316.7891 1325.3724 1331.7690 1335.2449 1342.5545 1356.7210 1379.7597 1381.0923 1394.9616 1402.0892 1441.1487 1457.0637 1462.7235 1471.7535 1473.6518 1475.9410 1478.9187 1494.6014 1495.7607 1585.7142 1630.9414 2866.8908 2903.1302 2945.0953 2960.6135 2962.7838 2972.4045 2984.5267 2990.6599 2994.6280 3000.7975 3024.6639 3036.2818 3048.0225 3051.2015 3057.8672 3092.3358 3100.8861 3112.0213 3141.8727 3149.4576 3574.0482 3582.8874
redmass: 4.4051 4.2343 4.2095 3.6609 3.5869 2.0964 1.6634 2.4866 2.8999 2.3466 1.7327 2.1404 2.7967 3.5851 3.4860 2.7829 1.1572 2.5187 3.3110 4.2047 3.5873 4.0216 2.8753 3.9573 2.8675 4.1553 4.5397 4.0087 2.8236 2.9078 3.2767 3.4429 3.8637 4.3697 2.9388 2.2913 1.8137 2.0130 1.9829 2.1555 2.0009 1.7722 3.8220 3.2394 1.4165 2.2952 2.0974 1.9814 2.7202 2.3955 2.3770 2.5659 3.0230 1.9642 2.7581 1.9940 2.3814 1.8132 1.7952 1.2385 1.3875 1.2794 1.4118 1.5157 1.5522 1.8843 1.6019 1.8898 1.3738 1.4228 2.8420 1.5194 1.4926 1.3377 1.4262 1.2508 1.5644 1.3637 1.4646 1.3778 1.5205 1.4798 1.4588 1.5129 3.3746 1.3542 1.5584 2.8919 1.1818 1.0811 1.0871 1.0937 1.0899 1.0606 2.2524 1.1463 7.1363 6.4426 1.0811 1.0799 1.0842 1.0656 1.0644 1.0664 1.0591 1.0613 1.0739 1.0430 1.0946 1.0957 1.1023 1.1073 1.0981 1.0990 1.0994 1.0888 1.0916 1.0938 1.0665 1.0660
irintensity: 0.3112 0.3990 0.4539 2.9600 1.2132 4.3447 8.4989 1.4228 3.7463 15.3475 69.6880 48.9018 1.8207 4.7024 15.4091 5.5101 140.1367 5.1060 2.4046 2.6427 1.7240 4.1589 6.9242 2.0324 0.9245 2.1964 1.0961 3.1833 8.1528 6.7520 5.1564 4.7412 2.1473 3.3441 5.5274 16.8574 28.1808 0.8572 9.9182 3.8718 12.3161 16.4677 33.6992 56.8510 3.5702 43.0605 57.6211 19.0884 23.8888 49.3342 16.0136 9.1700 17.1768 2.0450 17.3239 22.4061 7.1639 15.9264 3.7048 24.8471 104.5371 5.5012 6.4787 54.6635 2.0917 10.0042 11.9698 14.0633 3.6416 5.6967 23.4292 9.4555 27.5491 13.3250 0.9325 0.1462 3.3525 1.7145 0.9714 2.1841 1.5948 1.4401 1.4098 9.6127 24.0231 13.6468 13.0547 6.9394 7.1590 8.0608 4.8814 9.5889 6.4003 9.2779 104.8034 1.8287 30.8047 49.0474 39.9674 22.1187 37.3815 27.8303 46.5604 18.1185 99.2285 17.6076 19.8000 32.3684 39.3893 32.5720 33.0830 52.5796 34.8931 25.1590 13.3720 20.8944 12.6427 13.8383 5.3142 37.1933
temp: 298.150 k
press: 1.00000 atm
elementType: 8 8 8 6 6 6 6 6 6 6 6 6 6 6 6 6 6 6 6 6 1 1 1 1 1 1 1 1 1 1 1 1 1 1 1 1 1 1 1 1 1 1
symmnumber: 1
zpe: 932407.9 jmol-1
zpe.correction: 0.355135 hartree
zpe.thermalcorrener: 0.373014 hartree
zpe.thermalcorrenthalpy: 0.373958 hartree
zpe.thermalcorrgfe: 0.310784 hartree
zpe.sumelectzpe: -885.155346 hartree
zpe.sumelectthermal: -885.137467 hartree
zpe.sumelectthermalent: -885.136523 hartree
zpe.sumelectthermalfe: -885.199697 hartree
dipole: -1.4727 -2.1362 -1.9141
dipole: 3.2243
quadrupole: -105.3422 -118.4476 -120.8641
quadrupole: -9.9107 6.8957 1.8930
quadrupole: 9.5424 -3.5629 -5.9795 -9.9107 6.8957 1.8930
hfenergy: -885.5104811 hartree
pointgroup: C01 [X(C17H22O3)]
dipole: 0.5801341 0.835736 -0.7577379 debye
polarizability: 254.4060505|-6.8467781|179.2071947|-7.1944359|-5.3419075|123.8766188 unknown
InChI: InChI=1S/C17H22O3/c1-17-7-6-13-12-5-3-11(18)8-10(12)2-4-14(13)16(17)20-9-15(17)19/h3,5,8,13-16,18-19H,2,4,6-7,9H2,1H3
charge 0 multiplicity 1
42 atoms
O  2.86472 -1.778416 0.023353
O  5.12097 1.106423 0.34742
O  -5.9243 0.093786 0.402549
C  2.684208 0.613942 0.14135
C  1.986347 -0.659175 -0.401884
C  0.532334 -0.785207 0.032303
C  -0.22252 0.43978 -0.581602
C  1.973997 1.833725 -0.48672
C  0.444106 1.79643 -0.197667
C  4.120516 0.301149 -0.358507
C  -0.144101 -2.09144 -0.426871
C  4.25085 -1.236819 -0.089734
C  2.686752 0.68404 1.689788
C  -1.727581 0.366355 -0.273614
C  -1.561498 -2.178254 0.171503
C  -2.357113 -0.879429 0.038345
C  -2.543932 1.522924 -0.35242
C  -3.753046 -0.926863 0.256621
C  -3.936602 1.478083 -0.133501
C  -4.541282 0.23778 0.173306
H  2.007329 -0.617894 -1.520099
H  0.476925 -0.736456 1.138532
H  -0.111263 0.337015 -1.687201
H  2.136933 1.830509 -1.585389
H  2.405305 2.776282 -0.099964
H  0.249535 2.006476 0.871782
H  -0.028489 2.619636 -0.765778
H  4.17537 0.505871 -1.450578
H  0.460255 -2.961307 -0.113069
H  -0.193229 -2.107562 -1.535131
H  4.778921 -1.770403 -0.903935
H  4.769154 -1.414491 0.870729
H  2.934768 -0.296759 2.131431
H  3.444812 1.41311 2.021116
H  1.707185 0.995433 2.088671
H  -1.479412 -2.430376 1.249581
H  -2.12858 -3.007148 -0.293466
H  6.005882 0.980193 -0.077232
H  -2.091818 2.490287 -0.593356
H  -4.245826 -1.876326 0.493399
H  -4.537469 2.394356 -0.20352
H  -6.383514 0.966039 0.32036
