program: Orca
programVersion: 5.0.2
elementType: S P O O O O N C C C C C C C C C C H H H H H H H H H H H H H H H H H H H H
charge: 0
multiplicity: 1
keywords: wb97x-d3
keywords: def2-TZVPP
keywords: def2/J RIJCOSX
keywords: DEFGRID2
keywords: scfconv7
keywords: smallprint printgap noloewdin
keywords: NOSOSCF
formula: C10H20NO4PS
InChI: InChI=1/C10H20NO4PS/c1-6-11-16(17,13-5)15-9(4)7-10(12)14-8(2)3/h7-8,11H,6H2,1-5H3
37 atoms
S  -1.187186 2.55565 0.281741
P  -1.873549 0.800725 -0.109463
O  -1.088036 -0.059349 -1.26058
O  3.030013 -0.324609 0.849554
O  -1.76173 -0.277207 1.072815
O  3.057893 -1.342965 -1.143299
N  -3.419367 0.805918 -0.652131
C  4.419008 -0.635182 1.099833
C  -4.1067 -0.30657 -1.315182
C  0.189353 -0.526099 -1.29776
C  4.590373 -0.606828 2.603315
C  5.313348 0.368664 0.39884
C  -4.161861 -1.581757 -0.498623
C  1.074617 -0.258818 -0.32396
C  2.465094 -0.711964 -0.292609
C  0.383317 -1.319915 -2.538684
C  -2.30066 0.032134 2.35982
H  4.629065 -1.64178 0.732025
H  -3.665348 -0.509977 -2.294027
H  -5.12141 0.043385 -1.497548
H  -3.730334 1.718876 -0.953764
H  5.617958 -0.865595 2.856312
H  3.936565 -1.327291 3.094966
H  4.384943 0.384137 3.011026
H  5.192015 0.346028 -0.683715
H  6.356619 0.139596 0.616698
H  5.113488 1.382532 0.749204
H  -3.186793 -2.054103 -0.390491
H  -4.57421 -1.402227 0.494494
H  -4.810154 -2.296812 -1.004523
H  0.779668 0.346186 0.522103
H  -0.36242 -2.115737 -2.585227
H  1.368827 -1.761565 -2.603338
H  0.228049 -0.683356 -3.411946
H  -2.060149 -0.803899 3.009849
H  -1.853705 0.940424 2.764272
H  -3.3827 0.152368 2.316939
elementType: S P O N C H
totalener: -1488.52152905 hartree
nucrepener: 1609.10711405 hartree
electener: -3097.62864310 hartree
oneelecener: -5244.03459089 hartree
twoeener: 2146.40594779 hartree
cpcmener: -0.03001676 hartree
kineticenergy: 1483.75204691 hartree
xcener: -107.356594205910 hartree
chargesum: 0.0000000
charge: -0.458130 0.615750 -0.301478 -0.300146 -0.338252 -0.515828 -0.254627 0.159167 -0.027694 0.299548 -0.255705 -0.262407 -0.257754 -0.267008 0.494483 -0.258457 -0.103714 0.064497 0.090759 0.099252 0.173190 0.090992 0.097544 0.089348 0.092809 0.097276 0.090287 0.082631 0.084368 0.101186 0.088794 0.111320 0.107573 0.112624 0.131161 0.110879 0.115762
qa: -0.4581 0.6157 -0.3015 -0.3001 -0.3383 -0.5158 -0.2546 0.1592 -0.0277 0.2995 -0.2557 -0.2624 -0.2578 -0.2670 0.4945 -0.2585 -0.1037 0.0645 0.0908 0.0993 0.1732 0.0910 0.0975 0.0893 0.0928 0.0973 0.0903 0.0826 0.0844 0.1012 0.0888 0.1113 0.1076 0.1126 0.1312 0.1109 0.1158
va: 2.0057 5.4987 2.1671 2.1259 2.0316 1.9810 3.1212 3.8125 3.8956 3.7078 3.9334 3.9060 3.9137 3.7854 4.1996 3.9434 3.8215 1.0223 0.9978 0.9941 1.0165 1.0053 1.0081 1.0065 1.0172 1.0057 1.0066 1.0100 1.0051 1.0083 1.0714 1.0001 1.0340 1.0000 0.9894 1.0086 0.9963
dispcorr: -0.016771998 hartree
energy: -1488.538301045579
dipole: 5.83894 -7.87499 -2.03605 -10.79372 9.85386 -0.93986 4.78823 -4.35383 0.43440
magnitude: 2.28419 au
magnitude: 5.80595 debye
