program: Orca
programVersion: 5.0.2
elementType: S P O O O O N C C C C C C C C C C H H H H H H H H H H H H H H H H H H H H
charge: 0
multiplicity: 1
keywords: wb97x-d3
keywords: def2-TZVPP
keywords: def2/J RIJCOSX
keywords: DEFGRID2
keywords: scfconv7
keywords: smallprint printgap noloewdin
keywords: NOSOSCF
formula: C10H20NO4PS
InChI: InChI=1/C10H20NO4PS/c1-6-11-16(17,13-5)15-9(4)7-10(12)14-8(2)3/h7-8,11H,6H2,1-5H3
37 atoms
S  -2.962783 -1.778226 1.580815
P  -2.40807 -0.636068 0.133623
O  -0.812639 -0.664433 -0.250356
O  3.571316 0.338693 -0.754084
O  -2.817757 -1.100695 -1.344695
O  3.026197 0.430902 1.415316
N  -2.892785 0.918446 0.295741
C  4.96165 0.627772 -0.483638
C  -2.564512 2.00492 -0.62373
C  0.262642 -0.241099 0.46995
C  5.52026 1.240459 -1.749114
C  5.687639 -0.643458 -0.089807
C  -1.478739 2.924906 -0.101018
C  1.390333 -0.121556 -0.252829
C  2.708676 0.245166 0.257287
C  0.068681 0.010114 1.919559
C  -4.190678 -1.35207 -1.650244
H  5.022539 1.357808 0.326066
H  -3.475898 2.57481 -0.809443
H  -2.272251 1.577664 -1.582502
H  -3.162477 1.201517 1.228107
H  5.471383 0.544659 -2.588022
H  6.566652 1.501891 -1.593157
H  4.989224 2.152642 -2.021889
H  5.279609 -1.087846 0.817572
H  6.737711 -0.419362 0.099046
H  5.642826 -1.384989 -0.88896
H  -1.746349 3.333776 0.87434
H  -0.521325 2.41287 -0.005629
H  -1.341216 3.763394 -0.784725
H  1.331048 -0.329005 -1.313841
H  0.974629 0.38136 2.381766
H  -0.232205 -0.908024 2.425952
H  -0.72075 0.745696 2.085343
H  -4.62875 -2.065892 -0.952307
H  -4.773809 -0.431342 -1.63811
H  -4.214425 -1.774135 -2.651317
elementType: S P O N C H
totalener: -1488.52126365 hartree
nucrepener: 1585.86470082 hartree
electener: -3074.38596447 hartree
oneelecener: -5196.91012291 hartree
twoeener: 2122.52415844 hartree
cpcmener: -0.03238870 hartree
kineticenergy: 1483.73908588 hartree
xcener: -107.356449984832 hartree
chargesum: 0.0000000
charge: -0.458539 0.618005 -0.295259 -0.302797 -0.351856 -0.521029 -0.237000 0.161945 0.002290 0.217780 -0.253720 -0.263639 -0.271345 -0.291266 0.523805 -0.248068 -0.112886 0.063446 0.095409 0.094920 0.171030 0.089060 0.090815 0.097245 0.093269 0.097087 0.090340 0.091585 0.084793 0.099608 0.126169 0.116739 0.121481 0.107438 0.104163 0.119549 0.129432
qa: -0.4585 0.6180 -0.2953 -0.3028 -0.3519 -0.5210 -0.2370 0.1619 0.0023 0.2178 -0.2537 -0.2636 -0.2713 -0.2913 0.5238 -0.2481 -0.1129 0.0634 0.0954 0.0949 0.1710 0.0891 0.0908 0.0972 0.0933 0.0971 0.0903 0.0916 0.0848 0.0996 0.1262 0.1167 0.1215 0.1074 0.1042 0.1195 0.1294
va: 1.9947 5.5079 2.1462 2.1238 2.0690 1.9730 3.0706 3.8100 3.8478 3.7511 3.9312 3.9098 3.9390 3.8492 4.0925 3.8905 3.8437 1.0232 0.9980 1.0092 1.0184 1.0069 1.0052 1.0082 1.0161 1.0059 1.0065 1.0011 0.9998 1.0100 1.0331 1.0404 1.0093 1.0082 1.0057 0.9892 0.9904
dispcorr: -0.017124481 hartree
energy: -1488.538388126251
dipole: 16.20821 -16.97718 -0.76897 13.58948 -11.51892 2.07056 -6.97954 5.53420 -1.44534
magnitude: 2.63961 au
magnitude: 6.70937 debye
