program: Orca
programVersion: 5.0.2
elementType: S P O O O O N C C C C C C C C C C H H H H H H H H H H H H H H H H H H H H
charge: 0
multiplicity: 1
keywords: wb97x-d3
keywords: def2-TZVPP
keywords: def2/J RIJCOSX
keywords: DEFGRID2
keywords: scfconv7
keywords: smallprint printgap noloewdin
keywords: NOSOSCF
formula: C10H20NO4PS
InChI: InChI=1/C10H20NO4PS/c1-6-11-16(17,13-5)15-9(4)7-10(12)14-8(2)3/h7-8,11H,6H2,1-5H3
37 atoms
S  -1.191361 1.896586 1.273569
P  -2.051313 0.521741 0.237298
O  -1.116158 -0.772484 -0.137548
O  3.333258 -0.177072 0.759715
O  -3.230985 -0.28561 0.965314
O  3.024211 -0.539307 -1.428452
N  -2.678171 1.033824 -1.181408
C  4.765177 -0.042659 0.606842
C  -3.44067 0.206083 -2.11172
C  0.126493 -0.689202 -0.71939
C  5.416769 -1.411165 0.59468
C  5.233426 0.810922 1.765475
C  -4.940713 0.387147 -1.983439
C  1.170348 -0.506034 0.09811
C  2.577322 -0.422564 -0.30651
C  0.087493 -0.871382 -2.191126
C  -2.996371 -0.978316 2.194689
H  4.973381 0.47668 -0.330949
H  -3.170195 -0.838032 -1.957164
H  -3.119966 0.455073 -3.123911
H  -2.816673 2.030983 -1.263465
H  6.496784 -1.297112 0.49938
H  5.07679 -2.023022 -0.240248
H  5.218285 -1.949395 1.522871
H  5.035192 0.329769 2.724272
H  4.752974 1.789599 1.762181
H  6.308347 0.969508 1.687831
H  -5.297773 0.08378 -0.999725
H  -5.226043 1.427722 -2.14345
H  -5.456342 -0.216315 -2.730558
H  0.973453 -0.4029 1.157088
H  -0.436839 -0.03438 -2.656958
H  -0.472783 -1.77525 -2.435376
H  1.074102 -0.945937 -2.630601
H  -3.969957 -1.235095 2.603286
H  -2.427383 -1.89242 2.028283
H  -2.466567 -0.347351 2.909571
elementType: S P O N C H
totalener: -1488.52220226 hartree
nucrepener: 1592.54095887 hartree
electener: -3081.06316114 hartree
oneelecener: -5210.82785563 hartree
twoeener: 2129.76469449 hartree
cpcmener: -0.02993505 hartree
kineticenergy: 1483.73915941 hartree
xcener: -107.352088619528 hartree
chargesum: 0.0000000
charge: -0.466009 0.656068 -0.356714 -0.296356 -0.342966 -0.511734 -0.255941 0.159167 -0.010944 0.289156 -0.262869 -0.252656 -0.262231 -0.302422 0.526885 -0.251597 -0.101658 0.064665 0.096199 0.098717 0.164967 0.097680 0.093944 0.090387 0.089067 0.097148 0.090874 0.078595 0.086275 0.090940 0.117785 0.109402 0.114028 0.116028 0.126797 0.119556 0.099762
qa: -0.4660 0.6561 -0.3567 -0.2964 -0.3430 -0.5117 -0.2559 0.1592 -0.0109 0.2892 -0.2629 -0.2527 -0.2622 -0.3024 0.5269 -0.2516 -0.1017 0.0647 0.0962 0.0987 0.1650 0.0977 0.0939 0.0904 0.0891 0.0971 0.0909 0.0786 0.0863 0.0909 0.1178 0.1094 0.1140 0.1160 0.1268 0.1196 0.0998
va: 1.9915 5.4883 2.0585 2.1335 2.0652 1.9843 3.1203 3.8111 3.8483 3.6649 3.9095 3.9314 3.9729 3.9622 4.0970 3.9540 3.8376 1.0229 1.0064 0.9930 1.0213 1.0055 1.0164 1.0066 1.0069 1.0083 1.0054 1.0120 1.0010 1.0069 1.0409 1.0016 1.0003 1.0355 0.9896 0.9923 1.0064
dispcorr: -0.016734404 hartree
energy: -1488.538936668521
dipole: 6.99539 -8.16983 -1.17444 -6.58082 5.68773 -0.89309 -4.02126 3.48668 -0.53457
magnitude: 1.56930 au
magnitude: 3.98884 debye
