program: Orca
programVersion: 5.0.2
elementType: S P O O O O N C C C C C C C C C C H H H H H H H H H H H H H H H H H H H H
charge: 0
multiplicity: 1
keywords: wb97x-d3
keywords: def2-TZVPP
keywords: def2/J RIJCOSX
keywords: DEFGRID2
keywords: scfconv7
keywords: smallprint printgap noloewdin
keywords: NOSOSCF
formula: C10H20NO4PS
InChI: InChI=1/C10H20NO4PS/c1-6-11-16(17,13-5)15-9(4)7-10(12)14-8(2)3/h7-8,11H,6H2,1-5H3
37 atoms
S  -1.094888 1.800154 1.32496
P  -2.026508 0.515509 0.237432
O  -1.112692 -0.735644 -0.299822
O  3.332251 -0.629798 0.747246
O  -3.161937 -0.356145 0.961568
O  3.058653 -0.439082 -1.467347
N  -2.743003 1.138685 -1.091736
C  4.769841 -0.498444 0.657457
C  -3.524164 0.378016 -2.063221
C  0.140949 -0.596433 -0.846247
C  5.334434 -1.212202 1.866109
C  5.147366 0.968989 0.621693
C  -5.020642 0.463422 -1.833168
C  1.173086 -0.662673 0.002931
C  2.591059 -0.562732 -0.354589
C  0.124329 -0.433844 -2.320537
C  -2.858139 -1.154685 2.109113
H  5.11755 -0.995826 -0.250439
H  -3.195597 -0.660683 -2.043687
H  -3.277667 0.754301 -3.056805
H  -2.919914 2.133486 -1.067282
H  6.422623 -1.159405 1.842445
H  5.054819 -2.265984 1.876253
H  4.997995 -0.753478 2.797049
H  4.797214 1.485452 1.516706
H  4.741562 1.477063 -0.252825
H  6.232627 1.064888 0.583188
H  -5.30536 0.026316 -0.876452
H  -5.362164 1.499179 -1.85042
H  -5.551597 -0.073434 -2.619849
H  0.954453 -0.789876 1.055191
H  -0.351617 0.512516 -2.586778
H  -0.472117 -1.228964 -2.77134
H  1.116302 -0.453741 -2.754721
H  -2.289078 -2.04205 1.831532
H  -2.298472 -0.584372 2.851576
H  -3.80694 -1.462665 2.540802
elementType: S P O N C H
totalener: -1488.52209488 hartree
nucrepener: 1594.07786455 hartree
electener: -3082.59995943 hartree
oneelecener: -5213.92494018 hartree
twoeener: 2131.32498075 hartree
cpcmener: -0.02991275 hartree
kineticenergy: 1483.73760149 hartree
xcener: -107.351283851798 hartree
chargesum: -0.0000000
charge: -0.465422 0.651080 -0.357481 -0.296083 -0.342789 -0.510666 -0.254880 0.157873 -0.008723 0.279184 -0.251831 -0.261838 -0.258798 -0.295379 0.524464 -0.245057 -0.102784 0.064715 0.093184 0.098093 0.164927 0.090742 0.097095 0.089263 0.090568 0.094188 0.096984 0.078747 0.085237 0.090911 0.119093 0.107790 0.114592 0.115262 0.119622 0.100724 0.127395
qa: -0.4654 0.6511 -0.3575 -0.2961 -0.3428 -0.5107 -0.2549 0.1579 -0.0087 0.2792 -0.2518 -0.2618 -0.2588 -0.2954 0.5245 -0.2451 -0.1028 0.0647 0.0932 0.0981 0.1649 0.0907 0.0971 0.0893 0.0906 0.0942 0.0970 0.0787 0.0852 0.0909 0.1191 0.1078 0.1146 0.1153 0.1196 0.1007 0.1274
va: 1.9914 5.4913 2.0555 2.1326 2.0657 1.9856 3.1257 3.8126 3.8505 3.6676 3.9312 3.9103 3.9655 3.9631 4.1027 3.9518 3.8374 1.0233 1.0083 0.9941 1.0218 1.0053 1.0081 1.0068 1.0068 1.0154 1.0061 1.0123 1.0015 1.0071 1.0373 1.0053 0.9999 1.0357 0.9923 1.0058 0.9898
dispcorr: -0.016831354 hartree
energy: -1488.538926233328
dipole: 6.38019 -7.62413 -1.24394 -4.58629 3.69918 -0.88712 -3.57298 3.07497 -0.49801
magnitude: 1.60698 au
magnitude: 4.08461 debye
