program: Orca
programVersion: 5.0.2
elementType: S P O O O O N C C C C C C C C C C H H H H H H H H H H H H H H H H H H H H
charge: 0
multiplicity: 1
keywords: wb97x-d3
keywords: def2-TZVPP
keywords: def2/J RIJCOSX
keywords: DEFGRID2
keywords: scfconv7
keywords: smallprint printgap noloewdin
keywords: NOSOSCF
formula: C10H20NO4PS
InChI: InChI=1/C10H20NO4PS/c1-6-11-16(17,13-5)15-9(4)7-10(12)14-8(2)3/h7-8,11H,6H2,1-5H3
37 atoms
S  -1.546365 -0.461729 2.386843
P  -1.985406 -0.323347 0.52039
O  -1.17595 -1.343718 -0.483439
O  3.019632 0.458641 0.340301
O  -3.409345 -0.898444 0.061602
O  3.107535 -1.169266 -1.192677
N  -1.870359 1.19041 -0.08907
C  4.449807 0.670131 0.289198
C  -2.016312 1.503759 -1.509568
C  0.15046 -1.347071 -0.783359
C  4.83972 1.257863 1.628298
C  4.80055 1.584365 -0.867386
C  -2.698005 2.840919 -1.70797
C  1.023775 -0.52163 -0.180247
C  2.465488 -0.47743 -0.428998
C  0.410537 -2.371674 -1.827854
C  -4.5897 -0.432332 0.722669
H  4.945903 -0.294533 0.163534
H  -2.605945 0.719805 -1.983866
H  -1.037803 1.500735 -1.995709
H  -1.305176 1.838961 0.44245
H  5.919237 1.40489 1.656925
H  4.575148 0.592367 2.450336
H  4.366683 2.226265 1.798073
H  4.315517 2.55606 -0.762446
H  4.519526 1.158522 -1.830238
H  5.878256 1.749342 -0.884453
H  -3.704461 2.836924 -1.288877
H  -2.13446 3.648257 -1.237949
H  -2.774012 3.065613 -2.771962
H  0.680789 0.167177 0.579748
H  -0.209082 -2.168438 -2.703014
H  0.126075 -3.357236 -1.453865
H  1.446985 -2.40499 -2.135838
H  -4.77676 0.618823 0.50035
H  -5.415758 -1.029822 0.345738
H  -4.517115 -0.566426 1.802738
elementType: S P O N C H
totalener: -1488.52349473 hartree
nucrepener: 1603.06965092 hartree
electener: -3091.59314566 hartree
oneelecener: -5231.41651494 hartree
twoeener: 2139.82336929 hartree
cpcmener: -0.03179901 hartree
kineticenergy: 1483.73821825 hartree
xcener: -107.353237529413 hartree
chargesum: -0.0000000
charge: -0.454001 0.619571 -0.309351 -0.300137 -0.350997 -0.516529 -0.235376 0.156805 -0.010636 0.299198 -0.254487 -0.261929 -0.255615 -0.275067 0.492911 -0.248740 -0.115135 0.064135 0.100326 0.091854 0.173771 0.091354 0.097196 0.089059 0.089980 0.093379 0.097315 0.082791 0.087510 0.089331 0.088425 0.111374 0.111507 0.106245 0.117635 0.130244 0.106084
qa: -0.4540 0.6196 -0.3094 -0.3001 -0.3510 -0.5165 -0.2354 0.1568 -0.0106 0.2992 -0.2545 -0.2619 -0.2556 -0.2751 0.4929 -0.2487 -0.1151 0.0641 0.1003 0.0919 0.1738 0.0914 0.0972 0.0891 0.0900 0.0934 0.0973 0.0828 0.0875 0.0893 0.0884 0.1114 0.1115 0.1062 0.1176 0.1302 0.1061
va: 2.0007 5.4910 2.1795 2.1263 2.0741 1.9811 3.0581 3.8145 3.8516 3.6729 3.9333 3.9063 3.9621 3.7918 4.1829 3.9431 3.8496 1.0234 1.0047 0.9988 1.0151 1.0051 1.0082 1.0068 1.0067 1.0169 1.0058 1.0044 1.0004 1.0067 1.0730 1.0007 1.0010 1.0344 0.9893 0.9908 1.0040
dispcorr: -0.016511705 hartree
energy: -1488.540006439629
dipole: 9.49167 -10.44998 -0.95831 14.18656 -12.19863 1.98792 -9.64208 8.43952 -1.20257
magnitude: 2.51324 au
magnitude: 6.38814 debye
