program: Orca
programVersion: 5.0.2
elementType: S P O O O O N C C C C C C C C C C H H H H H H H H H H H H H H H H H H H H
charge: 0
multiplicity: 1
keywords: wb97x-d3
keywords: def2-TZVPP
keywords: def2/J RIJCOSX
keywords: DEFGRID2
keywords: scfconv7
keywords: smallprint printgap noloewdin
keywords: NOSOSCF
formula: C10H20NO4PS
InChI: InChI=1/C10H20NO4PS/c1-6-11-16(17,13-5)15-9(4)7-10(12)14-8(2)3/h7-8,11H,6H2,1-5H3
37 atoms
S  -2.779692 -1.1385 1.959477
P  -2.271183 -0.058932 0.447544
O  -0.684299 0.309569 0.304857
O  3.82914 0.539851 0.073095
O  -2.468632 -0.711806 -1.007963
O  3.167294 -1.573079 -0.253736
N  -2.931614 1.432553 0.458682
C  5.221371 0.189509 -0.094214
C  -2.848719 2.407769 -0.621623
C  0.406178 -0.490266 0.134913
C  6.015403 1.261309 0.619805
C  5.567274 0.105025 -1.568045
C  -4.11716 2.490305 -1.448021
C  1.573541 0.176635 0.146338
C  2.899551 -0.408821 -0.03342
C  0.189102 -1.948815 -0.044446
C  -3.687008 -1.386679 -1.330007
H  5.404247 -0.773628 0.387056
H  -1.999426 2.160489 -1.257521
H  -2.623328 3.380631 -0.182764
H  -3.609701 1.616958 1.183776
H  7.077471 1.026739 0.555946
H  5.752626 1.319603 1.67636
H  5.862535 2.242747 0.168356
H  5.3855 1.057708 -2.068011
H  5.000696 -0.669757 -2.0833
H  6.625172 -0.133771 -1.679063
H  -4.025297 3.274008 -2.200621
H  -4.319586 1.550856 -1.96281
H  -4.978633 2.72877 -0.822933
H  1.541663 1.248988 0.294779
H  1.118338 -2.496854 0.042328
H  -0.233909 -2.155479 -1.028587
H  -0.506117 -2.333865 0.701752
H  -4.537222 -0.704461 -1.310754
H  -3.569912 -1.780292 -2.336195
H  -3.871147 -2.211178 -0.641281
elementType: S P O N C H
totalener: -1488.52142720 hartree
nucrepener: 1568.50875963 hartree
electener: -3057.03018683 hartree
oneelecener: -5162.49667701 hartree
twoeener: 2105.46649017 hartree
cpcmener: -0.02987584 hartree
kineticenergy: 1483.74523329 hartree
xcener: -107.357680294282 hartree
chargesum: 0.0000000
charge: -0.462864 0.615375 -0.294722 -0.303400 -0.346010 -0.520937 -0.237561 0.161219 -0.003530 0.249418 -0.253763 -0.263768 -0.262423 -0.305092 0.515919 -0.258095 -0.108768 0.064213 0.089186 0.091825 0.169239 0.090974 0.096755 0.089055 0.090181 0.092696 0.097293 0.092698 0.084095 0.087935 0.127080 0.116074 0.124750 0.109409 0.119580 0.131681 0.114282
qa: -0.4629 0.6154 -0.2947 -0.3034 -0.3460 -0.5209 -0.2376 0.1612 -0.0035 0.2494 -0.2538 -0.2638 -0.2624 -0.3051 0.5159 -0.2581 -0.1088 0.0642 0.0892 0.0918 0.1692 0.0910 0.0968 0.0891 0.0902 0.0927 0.0973 0.0927 0.0841 0.0879 0.1271 0.1161 0.1247 0.1094 0.1196 0.1317 0.1143
va: 1.9843 5.5137 2.1696 2.1229 2.0240 1.9724 3.1332 3.8106 3.8735 3.7663 3.9319 3.9060 3.9413 3.8719 4.0968 3.8830 3.8208 1.0226 1.0095 0.9981 1.0206 1.0052 1.0084 1.0067 1.0065 1.0177 1.0057 1.0094 0.9998 1.0012 1.0321 1.0357 1.0024 1.0277 0.9882 0.9894 1.0073
dispcorr: -0.016220291 hartree
energy: -1488.537647490701
dipole: 10.72061 -11.92967 -1.20905 8.16107 -6.42425 1.73682 -12.59722 11.05634 -1.54088
magnitude: 2.61776 au
magnitude: 6.65381 debye
