program: Orca
programVersion: 5.0.2
elementType: S P O O O O N C C C C C C C C C C H H H H H H H H H H H H H H H H H H H H
charge: 0
multiplicity: 1
keywords: wb97x-d3
keywords: def2-TZVPP
keywords: def2/J RIJCOSX
keywords: DEFGRID2
keywords: scfconv7
keywords: smallprint printgap noloewdin
keywords: NOSOSCF
formula: C10H20NO4PS
InChI: InChI=1/C10H20NO4PS/c1-6-11-16(17,13-5)15-9(4)7-10(12)14-8(2)3/h7-8,11H,6H2,1-5H3
37 atoms
S  -2.520667 -0.902323 2.108997
P  -2.232412 -0.007574 0.427965
O  -0.680792 0.329512 0.038798
O  3.841556 0.48552 0.089478
O  -2.619851 -0.822326 -0.902797
O  3.170841 -1.611115 -0.318277
N  -2.905302 1.475501 0.347246
C  5.238505 0.122979 0.000451
C  -2.957364 2.325055 -0.837478
C  0.40559 -0.491562 -0.047162
C  5.991582 1.145123 0.823175
C  5.682058 0.108939 -1.44882
C  -4.295852 2.287144 -1.548831
C  1.58138 0.155805 0.020815
C  2.908147 -0.446507 -0.093927
C  0.16778 -1.944833 -0.238499
C  -3.876288 -1.501949 -0.970741
H  5.377652 -0.86622 0.44139
H  -2.159927 2.031445 -1.519285
H  -2.727165 3.344832 -0.527425
H  -3.482211 1.750842 1.128742
H  7.054856 0.908212 0.810203
H  5.664751 1.142703 1.863282
H  5.869041 2.152102 0.421849
H  5.556497 1.09133 -1.906865
H  5.134364 -0.622292 -2.042511
H  6.73937 -0.151378 -1.501577
H  -4.507182 1.2962 -1.950937
H  -5.107901 2.563123 -0.875038
H  -4.297769 2.993971 -2.379321
H  1.556293 1.22785 0.17204
H  1.090152 -2.506994 -0.170336
H  -0.273434 -2.131512 -1.218542
H  -0.5211 -2.330591 0.513625
H  -3.938773 -1.947053 -1.961791
H  -3.93436 -2.290364 -0.218538
H  -4.712775 -0.813008 -0.836837
elementType: S P O N C H
totalener: -1488.52183655 hartree
nucrepener: 1567.87094250 hartree
electener: -3056.39277905 hartree
oneelecener: -5161.29009737 hartree
twoeener: 2104.89731832 hartree
cpcmener: -0.03007512 hartree
kineticenergy: 1483.73533347 hartree
xcener: -107.355090344465 hartree
chargesum: -0.0000000
charge: -0.464381 0.620253 -0.300704 -0.302081 -0.345342 -0.519807 -0.242877 0.160971 -0.005457 0.244911 -0.252570 -0.263915 -0.263048 -0.305306 0.518894 -0.243406 -0.112477 0.063799 0.090648 0.092193 0.171124 0.090558 0.096778 0.089085 0.090239 0.093731 0.097346 0.084386 0.087704 0.093081 0.127072 0.114842 0.119926 0.105239 0.133431 0.115807 0.119352
qa: -0.4644 0.6203 -0.3007 -0.3021 -0.3453 -0.5198 -0.2429 0.1610 -0.0055 0.2449 -0.2526 -0.2639 -0.2630 -0.3053 0.5189 -0.2434 -0.1125 0.0638 0.0906 0.0922 0.1711 0.0906 0.0968 0.0891 0.0902 0.0937 0.0973 0.0844 0.0877 0.0931 0.1271 0.1148 0.1199 0.1052 0.1334 0.1158 0.1194
va: 1.9793 5.5082 2.1576 2.1247 2.0261 1.9736 3.1357 3.8101 3.8734 3.7514 3.9305 3.9103 3.9361 3.8854 4.0976 3.8872 3.8208 1.0234 1.0097 0.9985 1.0202 1.0054 1.0084 1.0070 1.0064 1.0163 1.0056 1.0000 1.0013 1.0099 1.0324 1.0362 1.0033 1.0274 0.9892 1.0063 0.9892
dispcorr: -0.016263003 hartree
energy: -1488.538099549426
dipole: 9.49499 -10.86634 -1.37135 6.84133 -5.25106 1.59027 -11.75971 10.28336 -1.47636
magnitude: 2.56694 au
magnitude: 6.52465 debye
