program: Orca
programVersion: 5.0.2
elementType: S P O O O O N C C C C C C C C C C H H H H H H H H H H H H H H H H H H H H
charge: 0
multiplicity: 1
keywords: wb97x-d3
keywords: def2-TZVPP
keywords: def2/J RIJCOSX
keywords: DEFGRID2
keywords: scfconv7
keywords: smallprint printgap noloewdin
keywords: NOSOSCF
formula: C10H20NO4PS
InChI: InChI=1/C10H20NO4PS/c1-6-11-16(17,13-5)15-9(4)7-10(12)14-8(2)3/h7-8,11H,6H2,1-5H3
37 atoms
S  -2.495223 -0.918944 2.098819
P  -2.220991 -0.01111 0.422445
O  -0.674621 0.331511 0.022151
O  3.850861 0.498446 0.095807
O  -2.617098 -0.821573 -0.909276
O  3.180073 -1.587426 -0.359664
N  -2.89591 1.472679 0.354379
C  5.245936 0.133743 -0.007099
C  -2.938877 2.337714 -0.819079
C  0.416903 -0.482919 -0.059575
C  6.009404 1.143117 0.821927
C  5.680959 0.135537 -1.459352
C  -4.264416 2.294776 -1.554199
C  1.589274 0.169091 0.02109
C  2.916684 -0.42919 -0.106384
C  0.185866 -1.93607 -0.260451
C  -3.895262 -1.461207 -0.975195
H  5.384592 -0.861151 0.421363
H  -2.126596 2.062933 -1.49128
H  -2.725616 3.355526 -0.490613
H  -3.476288 1.738118 1.136476
H  5.682412 1.138244 1.862017
H  5.898875 2.154324 0.426874
H  7.07028 0.893806 0.808105
H  6.737726 -0.125249 -1.521918
H  5.553633 1.123103 -1.905614
H  5.129097 -0.588359 -2.058033
H  -5.091812 2.547636 -0.890129
H  -4.2611 3.016863 -2.37145
H  -4.455603 1.309049 -1.978588
H  1.562219 1.239598 0.182282
H  -0.250507 -2.11892 -1.243564
H  -0.505266 -2.328067 0.486836
H  1.10999 -2.495214 -0.190458
H  -3.942554 -2.304464 -0.285651
H  -4.706899 -0.767095 -0.75061
H  -4.013629 -1.822902 -1.993962
elementType: S P O N C H
totalener: -1488.52190429 hartree
nucrepener: 1568.45854024 hartree
electener: -3056.98044452 hartree
oneelecener: -5162.46711754 hartree
twoeener: 2105.48667302 hartree
cpcmener: -0.03007851 hartree
kineticenergy: 1483.73738006 hartree
xcener: -107.355402460884 hartree
chargesum: 0.0000000
charge: -0.464116 0.621020 -0.300958 -0.302668 -0.345979 -0.519266 -0.244090 0.162113 -0.005415 0.244009 -0.252968 -0.264586 -0.264088 -0.304416 0.518854 -0.243312 -0.117190 0.063621 0.091074 0.092480 0.171679 0.096628 0.089031 0.090810 0.097410 0.090339 0.093539 0.087793 0.093546 0.084934 0.127633 0.119800 0.105355 0.114600 0.118514 0.119159 0.135110
qa: -0.4641 0.6210 -0.3010 -0.3027 -0.3460 -0.5193 -0.2441 0.1621 -0.0054 0.2440 -0.2530 -0.2646 -0.2641 -0.3044 0.5189 -0.2433 -0.1172 0.0636 0.0911 0.0925 0.1717 0.0966 0.0890 0.0908 0.0974 0.0903 0.0935 0.0878 0.0935 0.0849 0.1276 0.1198 0.1054 0.1146 0.1185 0.1192 0.1351
va: 1.9790 5.5067 2.1580 2.1251 2.0236 1.9739 3.1338 3.8091 3.8728 3.7519 3.9309 3.9090 3.9328 3.8872 4.0955 3.8876 3.8225 1.0233 1.0097 0.9985 1.0200 1.0085 1.0068 1.0053 1.0055 1.0064 1.0167 1.0014 1.0101 1.0001 1.0320 1.0034 1.0276 1.0357 1.0054 0.9901 0.9891
dispcorr: -0.016298332 hartree
energy: -1488.538202617566
dipole: 9.46487 -10.85057 -1.38570 7.02215 -5.40006 1.62209 -11.70565 10.26369 -1.44196
magnitude: 2.57499 au
magnitude: 6.54511 debye
